BDBM50555100 CHEMBL4749457
SMILES Cc1noc(C)c1-c1[nH]ncc1-c1ccncc1
InChI Key InChIKey=JYTPHNOPQGAILG-UHFFFAOYSA-N
Data  2 Kd
  Tab Delimited (TSV)   2D SDfile   Computed 3D by Vconf -m prep SDfile
Find this compound or compounds like it in BindingDB:
Activity Spreadsheet -- Enzyme Inhibition Constant Data from BindingDB
Found 2 hits for monomerid = 50555100
TargetHistone-lysine N-methyltransferase NSD3(Homo sapiens (Human))TBA
LigandPNGBDBM50555100(CHEMBL4749457)
Affinity DataKd:  3.00E+5nM. Assay description: Binding affinity to recombinant human NSD3 PWWP1 domain (247 to 398 residues) by SPR analysis
Ligand InfoPC cidPC sid
In DepthDetails PubMed
TargetHistone-lysine N-methyltransferase NSD3(Homo sapiens (Human))TBA
LigandPNGBDBM50555100(CHEMBL4749457)
Affinity DataKd:  3.00E+5nM. Assay description: Binding affinity to NSD3 PWWP1 domain (263 to 398 residues) (unknown origin) expressed in Escherichia coli BL21(DE3) by SPR method
Ligand InfoPC cidPC sid
In DepthDetails ArticlePubMed