BDBM50556036 CHEMBL4776573
SMILES CS(=O)(=NS(=O)(=O)c1ccccc1)n1cc2CN(Cc2n1)[C@H]1CO[C@@H]([C@@H](N)C1)c1cc(F)ccc1F
InChI Key InChIKey=ZXOLTKZKSOZTCH-IGAIMAHKSA-N
Data  1 IC50
  Tab Delimited (TSV)   2D SDfile   Computed 3D by Vconf -m prep SDfile
Find this compound or compounds like it in BindingDB:
Activity Spreadsheet -- Enzyme Inhibition Constant Data from BindingDB
Found 1 hit for monomerid = 50556036
TargetDipeptidyl peptidase 4(Homo sapiens (Human))
Endotherm
Curated by ChEMBL
LigandPNGBDBM50556036(CHEMBL4776573)
Affinity DataIC50:  18nM. Assay description: Inhibition of human DPP4 expressed in baculovirus expression system using Gly-Pro-AMC as substrate by fluorometric assay
Ligand InfoPC cidPC sid
In DepthDetails ArticlePubMed