BDBM50556043 CHEMBL4740873
SMILES CN=[S@@]1(=O)C[C@](C)(N=C(N)N1CC(F)(F)F)c1cc(NC(=O)c2ncc(cc2C)C#N)ccc1F
InChI Key InChIKey=IGELCVKXEKUAED-NVXHTHCOSA-N
Data  1 IC50
  Tab Delimited (TSV)   2D SDfile   Computed 3D by Vconf -m prep SDfile
Find this compound or compounds like it in BindingDB:
Activity Spreadsheet -- Enzyme Inhibition Constant Data from BindingDB
Found 1 hit for monomerid = 50556043
TargetBeta-secretase 1(Homo sapiens (Human))
Endotherm
Curated by ChEMBL
LigandPNGBDBM50556043(CHEMBL4740873)
Affinity DataIC50:  0.590nM. Assay description: Inhibition of BACE1 in HEK293 cells harboring APP assessed as reduction in amyloidbeta 40 level measured after 18 to 20 hrs by AlphaLISA Assay
Ligand InfoPC cidPC sid
In DepthDetails ArticlePubMed