BDBM50556878 CHEMBL4742343
SMILES OC(=O)c1cc(F)c(cc1O)N(Cc1ccc(cc1)C1CCCCC1)C(=O)[C@H]1CCN1S(=O)(=O)c1c(F)c(F)c(F)c(F)c1F
InChI Key InChIKey=DSTDCVGDUDNSTO-HXUWFJFHSA-N
Data  1 IC50
  Tab Delimited (TSV)   2D SDfile   Computed 3D by Vconf -m prep SDfile
Find this compound or compounds like it in BindingDB:
Activity Spreadsheet -- Enzyme Inhibition Constant Data from BindingDB
Found 1 hit for monomerid = 50556878
TargetSignal transducer and activator of transcription 3(Mus musculus (mouse))
University Of Hawaii Cancer Center
Curated by ChEMBL
LigandPNGBDBM50556878(CHEMBL4742343)
Affinity DataIC50:  660nM. Assay description: Inhibition of oligonucleotide [32P]-labelled 5'-AGCITCATTTCCCGTAAATCCCTA probe binding to STAT3 SH2 domain in mouse NIH3T3/v-Src nuclear extract prei...
Ligand InfoPC cidPC sid
In DepthDetails ArticlePubMed