BDBM50558038 CHEMBL4798311
SMILES CC[C@H](C)[C@@H]1NC(=O)[C@@H](Cc2ccc(O)cc2)NC(=O)[C@@H](NC(=O)[C@@H](NC(=O)[C@@H](NC(=O)[C@H](CCCNC(N)=N)NC(=O)[C@@H](NC(=O)[C@H](Cc2ccc(O)cc2)NC(=O)[C@H](CC(O)=O)NC(=O)[C@H](CC(C)C)NC(=O)CNC(=O)[C@H](CSSC[C@@H]2NC(=O)[C@H](CSSC[C@H](NC(=O)CNC(=O)[C@H](CCC(O)=O)NC(=O)[C@H](CCCNC(N)=N)NC2=O)C(=O)N[C@@H](CO)C(=O)N[C@@H](CCSC)C(=O)N[C@@H](CCCCN)C(=O)N[C@@H](CCC(O)=O)C(=O)N[C@@H](CC(C)C)C(=O)N[C@@H](CO)C(=O)N[C@@H]([C@@H](C)O)C(=O)N[C@@H](CC(C)C)C(=O)N[C@@H](CSSC[C@H](NC1=O)C(=O)N[C@@H](C)C(=O)N[C@@H](CO)C(=O)N[C@@H](CO)C(=O)N[C@@H](CCCNC(N)=N)C(=O)N[C@@H](Cc1c[nH]c2ccccc12)C(O)=O)C(O)=O)NC(=O)[C@H](CC(C)C)NC(=O)[C@H](C)NC(=O)[C@H](CCC(N)=O)NC(=O)[C@H](CC(C)C)NC(=O)[C@H](CC(O)=O)NC(=O)[C@@H](N)CCCNC(N)=N)NC(=O)[C@H](CC(C)C)NC(=O)[C@H](CCCCN)NC(=O)[C@@H](NC(=O)[C@@H](NC(=O)[C@H](CCC(N)=O)NC(=O)[C@H](CCCNC(N)=N)NC(=O)[C@@H](N)CO)[C@@H](C)O)C(C)C)C(C)C)[C@@H](C)O)C(C)C)[C@@H](C)CC
InChI Key InChIKey=ITPPDQYGYUOOQI-XDJXUSIBSA-N
Data  2 KI  2 EC50
  Tab Delimited (TSV)   2D SDfile   Computed 3D by Vconf -m prep SDfile
Find this compound or compounds like it in BindingDB:
Activity Spreadsheet -- Enzyme Inhibition Constant Data from BindingDB
Found 4 hits for monomerid = 50558038
TargetRelaxin-3 receptor 2(Homo sapiens (Human))
The University Of Queensland
Curated by ChEMBL
LigandPNGBDBM50558038(CHEMBL4798311)
Affinity DataKi:  1.60nM. Assay description: Displacement of europium-labeled Eu(A)-mINSL5 from human RXFP4 expressed in CHO-K1 cells
Ligand InfoPC cidPC sid
In DepthDetails ArticlePubMed
TargetRelaxin-3 receptor 2(Homo sapiens (Human))
The University Of Queensland
Curated by ChEMBL
LigandPNGBDBM50558038(CHEMBL4798311)
Affinity DataKi:  1.60nM. Assay description: Displacement of europium-labeled Eu(A)-mINSL5 from human RXFP4 expressed in CHO-K1 cells
Ligand InfoPC cidPC sid
In DepthDetails ArticlePubMed
TargetRelaxin-3 receptor 2(Homo sapiens (Human))
The University Of Queensland
Curated by ChEMBL
LigandPNGBDBM50558038(CHEMBL4798311)
Affinity DataEC50:  0.513nM. Assay description: Agonist activity at human RXFP4 expressed in CHO-K1 cells assessed as reduction in forskolin-induced cAMP production by pCRE beta-galactosidase repor...
Ligand InfoPC cidPC sid
In DepthDetails ArticlePubMed
TargetRelaxin-3 receptor 2(Homo sapiens (Human))
The University Of Queensland
Curated by ChEMBL
LigandPNGBDBM50558038(CHEMBL4798311)
Affinity DataEC50:  0.510nM. Assay description: Agonist activity at human RXFP4 expressed in CHO-K1 cells assessed as reduction in forskolin-induced cAMP production by pCRE beta-galactosidase repor...
Ligand InfoPC cidPC sid
In DepthDetails ArticlePubMed