BDBM50558779 CHEMBL4759209
SMILES Cl.[H][C@]12[C@H](C(O)=O)[C@@]1([H])[C@@](N)([C@H](CSc1ccccc1)[C@H]2O)C(O)=O
InChI Key InChIKey=LNXVTBIUHMGHCE-NHDMYCFKSA-N
Data  2 KI  2 IC50
  Tab Delimited (TSV)   2D SDfile   Computed 3D by Vconf -m prep SDfile
Find this compound or compounds like it in BindingDB:
Activity Spreadsheet -- Enzyme Inhibition Constant Data from BindingDB
Found 4 hits for monomerid = 50558779
TargetMetabotropic glutamate receptor 3(Homo sapiens (Human))
Centro De Investigaci£N Lilly S.A. Avda. De La Industria
Curated by ChEMBL
LigandPNGBDBM50558779(CHEMBL4759209)
Affinity DataKi:  19nM. Assay description: Displacement of [3H]-LY459477 from recombinant human mGlu3 receptor expressed in hamster AV12 cell membranes co-expressing rat EAAT1 incubated for 90...
Ligand InfoPC cidPC sid
In DepthDetails ArticlePubMed
TargetMetabotropic glutamate receptor 2(Homo sapiens (Human))
Centro De Investigaci£N Lilly S.A. Avda. De La Industria
Curated by ChEMBL
LigandPNGBDBM50558779(CHEMBL4759209)
Affinity DataKi:  21nM. Assay description: Displacement of [3H]-LY459477 from recombinant human mGlu2 receptor expressed in hamster AV12 cell membranes co-expressing rat EAAT1 incubated for 90...
Ligand InfoPC cidPC sid
In DepthDetails ArticlePubMed
TargetMetabotropic glutamate receptor 2(Homo sapiens (Human))
Centro De Investigaci£N Lilly S.A. Avda. De La Industria
Curated by ChEMBL
LigandPNGBDBM50558779(CHEMBL4759209)
Affinity DataIC50:  114nM. Assay description: Antagonist activity at human recombinant mGlu2 receptor stably expressed in golden hamster AV12 cells co-expressing rat EAAT1 assessed as reduction i...
Ligand InfoPC cidPC sid
In DepthDetails ArticlePubMed
TargetMetabotropic glutamate receptor 3(Homo sapiens (Human))
Centro De Investigaci£N Lilly S.A. Avda. De La Industria
Curated by ChEMBL
LigandPNGBDBM50558779(CHEMBL4759209)
Affinity DataIC50:  202nM. Assay description: Antagonist activity at human recombinant mGlu3 receptor stably expressed in golden hamster AV12 cells co-expressing rat EAAT1 assessed as reduction i...
Ligand InfoPC cidPC sid
In DepthDetails ArticlePubMed