BDBM50563549 CHEMBL4800422
SMILES CC(C)(C)c1ccc(cc1)-c1coc2ccc(nc12)-c1cc[nH]n1
InChI Key InChIKey=SDFNLJHDZXQOCL-UHFFFAOYSA-N
Data  10 IC50
  Tab Delimited (TSV)   2D SDfile   Computed 3D by Vconf -m prep SDfile
Find this compound or compounds like it in BindingDB:
Activity Spreadsheet -- Enzyme Inhibition Constant Data from BindingDB
Found 10 hits for monomerid = 50563549
TargetDual specificity protein kinase CLK1(Homo sapiens (Human))
Masaryk University
Curated by ChEMBL
LigandPNGBDBM50563549(CHEMBL4800422)
Affinity DataIC50: >3.00E+3nM. Assay description: Inhibition of human recombinant CLK1 using ERMRPRKRQGSVR substrate by radiometric scintillation assay
Ligand InfoPC cidPC sid
In DepthDetails ArticlePubMed
TargetDual specificity protein kinase CLK2(Homo sapiens (Human))
Masaryk University
Curated by ChEMBL
LigandPNGBDBM50563549(CHEMBL4800422)
Affinity DataIC50: >3.00E+3nM. Assay description: Inhibition of human recombinant CLK2 using YRRAAVPPSPSLSR substrate by radiometric scintillation assay
Ligand InfoPC cidPC sid
In DepthDetails ArticlePubMed
TargetDual specificity protein kinase CLK3(Homo sapiens (Human))
Masaryk University
Curated by ChEMBL
LigandPNGBDBM50563549(CHEMBL4800422)
Affinity DataIC50: >3.00E+3nM. Assay description: Inhibition of human full length recombinant CLK3 using ERMRPRKRQGSVR substrate by radiometric scintillation assay
Ligand InfoPC cidPC sid
In DepthDetails ArticlePubMed
TargetDual specificity protein kinase CLK4(Homo sapiens (Human))
Masaryk University
Curated by ChEMBL
LigandPNGBDBM50563549(CHEMBL4800422)
Affinity DataIC50: >3.00E+3nM. Assay description: Inhibition of human recombinant CLK4 using YRRAAVPPSPSLS substrate by radiometric scintillation assay
Ligand InfoPC cidPC sid
In DepthDetails ArticlePubMed
TargetHomeodomain-interacting protein kinase 3(Homo sapiens (Human))
Masaryk University
Curated by ChEMBL
LigandPNGBDBM50563549(CHEMBL4800422)
Affinity DataIC50: >3.00E+3nM. Assay description: Inhibition of human recombinant HIPK3 using myelin substrate by radiometric scintillation assay
Ligand InfoPC cidPC sid
In DepthDetails ArticlePubMed
TargetDual specificity tyrosine-phosphorylation-regulated kinase 1B(Homo sapiens (Human))
Masaryk University
Curated by ChEMBL
LigandPNGBDBM50563549(CHEMBL4800422)
Affinity DataIC50: >3.00E+3nM. Assay description: Inhibition of human full length recombinant DYRK1B using RRRFRPASPLRGPP substrate by radiometric scintillation assay
Ligand InfoPC cidPC sid
In DepthDetails ArticlePubMed
TargetDual specificity tyrosine-phosphorylation-regulated kinase 2(Homo sapiens (Human))
Masaryk University
Curated by ChEMBL
LigandPNGBDBM50563549(CHEMBL4800422)
Affinity DataIC50: >3.00E+3nM. Assay description: Inhibition of human full length recombinant DYRK2 using casein substrate by radiometric scintillation assay
Ligand InfoPC cidPC sid
In DepthDetails ArticlePubMed
TargetHomeodomain-interacting protein kinase 1(Homo sapiens (Human))
Masaryk University
Curated by ChEMBL
LigandPNGBDBM50563549(CHEMBL4800422)
Affinity DataIC50: >3.00E+3nM. Assay description: Inhibition of human recombinant HIPK1 using myelin substrate by radiometric scintillation assay
Ligand InfoPC cidPC sid
In DepthDetails ArticlePubMed
TargetHomeodomain-interacting protein kinase 2(Homo sapiens (Human))
Masaryk University
Curated by ChEMBL
LigandPNGBDBM50563549(CHEMBL4800422)
Affinity DataIC50:  1.28E+3nM. Assay description: Inhibition of human recombinant HIPK2 using myelin substrate by radiometric scintillation assay
Ligand InfoPC cidPC sid
In DepthDetails ArticlePubMed
TargetDual specificity tyrosine-phosphorylation-regulated kinase 1A(Homo sapiens (Human))
Masaryk University
Curated by ChEMBL
LigandPNGBDBM50563549(CHEMBL4800422)
Affinity DataIC50: >3.00E+3nM. Assay description: Inhibition of human full length recombinant DYRK1A using RRRFRPASPLRGPP substrate by radiometric scintillation assay
Ligand InfoPC cidPC sid
In DepthDetails ArticlePubMed