BDBM50564920 CHEMBL4789607
SMILES COc1ccc(cc1C(=O)Nc1ccc2n(C)c(=O)c(C)cc2c1)C(=O)NO
InChI Key InChIKey=SUIWTHQZBYYCGP-UHFFFAOYSA-N
Data  3 IC50  1 Kd
  Tab Delimited (TSV)   2D SDfile   Computed 3D by Vconf -m prep SDfile
Find this compound or compounds like it in BindingDB:
Activity Spreadsheet -- Enzyme Inhibition Constant Data from BindingDB
Found 4 hits for monomerid = 50564920
TargetHistone deacetylase 1(Homo sapiens (Human))
Martin-Luther University Of Halle-Wittenberg
Curated by ChEMBL
LigandPNGBDBM50564920(CHEMBL4789607)
Affinity DataIC50:  6.90E+3nM. Assay description: Inhibition of recombinant human HDAC1 using Z-(Ac)Lys-AMC as substrate after 90 mins by fluorescence based micro plate assay
Ligand InfoPC cidPC sid
In DepthDetails ArticlePubMed
TargetPeregrin(Homo sapiens (Human))
Martin-Luther University Of Halle-Wittenberg
Curated by ChEMBL
LigandPNGBDBM50564920(CHEMBL4789607)
Affinity DataKd:  857nM. Assay description: Binding affinity to BRPF1 (unknown origin) by Isothermal titration calorimetry
Ligand InfoPC cidPC sid
In DepthDetails ArticlePubMed
TargetHistone deacetylase 8(Homo sapiens (Human))
Martin-Luther University Of Halle-Wittenberg
Curated by ChEMBL
LigandPNGBDBM50564920(CHEMBL4789607)
Affinity DataIC50:  65nM. Assay description: Inhibition of human recombinant HDAC8 using H2N-Arg-His-Lys(Ac)-Lys(Ac)-AMC as substrate after 90 mins by fluorescence based micro plate assay
Ligand InfoPC cidPC sid
In DepthDetails ArticlePubMed
TargetHistone deacetylase 6(Homo sapiens (Human))
Martin-Luther University Of Halle-Wittenberg
Curated by ChEMBL
LigandPNGBDBM50564920(CHEMBL4789607)
Affinity DataIC50:  709nM. Assay description: Inhibition of recombinant human HDAC6 using Z-(Ac)Lys-AMC as substrate after 90 mins by fluorescence based micro plate assay
Ligand InfoPC cidPC sid
In DepthDetails ArticlePubMed