BDBM50564927 CHEMBL4786813
SMILES COc1ccc(cc1S(=O)(=O)Nc1ccc2n(C)c(=O)c(C)cc2c1)C(=O)NO
InChI Key InChIKey=HVHLFMDXTXHXRM-UHFFFAOYSA-N
Data  1 IC50  1 Kd
  Tab Delimited (TSV)   2D SDfile   Computed 3D by Vconf -m prep SDfile
Find this compound or compounds like it in BindingDB:
Activity Spreadsheet -- Enzyme Inhibition Constant Data from BindingDB
Found 2 hits for monomerid = 50564927
TargetPeregrin(Homo sapiens (Human))
Martin-Luther University Of Halle-Wittenberg
Curated by ChEMBL
LigandPNGBDBM50564927(CHEMBL4786813)
Affinity DataKd:  67nM. Assay description: Binding affinity to BRPF1 (unknown origin) by Isothermal titration calorimetry
In DepthDetails ArticlePubMed
TargetHistone deacetylase 8(Homo sapiens (Human))
Martin-Luther University Of Halle-Wittenberg
Curated by ChEMBL
LigandPNGBDBM50564927(CHEMBL4786813)
Affinity DataIC50:  443nM. Assay description: Inhibition of human recombinant HDAC8 using H2N-Arg-His-Lys(Ac)-Lys(Ac)-AMC as substrate after 90 mins by fluorescence based micro plate assay
In DepthDetails ArticlePubMed