BDBM50565506 CHEMBL4792975
SMILES CN1CCCN(CC1)c1cc(CN2CCC[C@H]2c2ncccc2C)nc(C)n1
InChI Key InChIKey=PXVPDOMSKVKPLE-FQEVSTJZSA-N
Data  1 IC50
  Tab Delimited (TSV)   2D SDfile   Computed 3D by Vconf -m prep SDfile
Find this compound or compounds like it in BindingDB:
Activity Spreadsheet -- Enzyme Inhibition Constant Data from BindingDB
Found 1 hit for monomerid = 50565506
TargetC-X-C chemokine receptor type 4(Homo sapiens (Human))
Soochow University
Curated by ChEMBL
LigandPNGBDBM50565506(CHEMBL4792975)
Affinity DataIC50:  0.400nM. Assay description: Antagonist activity at CXCR4 in human CD4-positive T cells assessed as inhibition of CXCL12-induced cytosolic calcium flux preincubated for 20 mins f...
Ligand InfoPC cidPC sid
In DepthDetails ArticlePubMed