BDBM50566082 CHEMBL4779359
SMILES CN1CCN(Cc2ccc(-c3c[nH]c4ccncc34)c(OCCc3ccc(cc3)-c3cccc4ccncc34)c2)CC1
InChI Key InChIKey=KOBJJEIVOKWSMI-UHFFFAOYSA-N
Data  2 IC50  1 Kd
PDB links: 1 PDB ID matches this monomer.
  Tab Delimited (TSV)   2D SDfile   Computed 3D by Vconf -m prep SDfile
Find this compound or compounds like it in BindingDB:
Activity Spreadsheet -- Enzyme Inhibition Constant Data from BindingDB
Found 3 hits for monomerid = 50566082
TargetTumor necrosis factor(Homo sapiens (Human))
Abbvie
Curated by ChEMBL
LigandPNGBDBM50566082(CHEMBL4779359)
Affinity DataKd:  2.40nM. Assay description: Binding affinity to biotinylated human TNFalpha trimer (77 to 233 residues) expressed in Escherichia coli BL21(DE3) by SPR analysis
Ligand InfoPC cidPC sidPDB
TargetTumor necrosis factor(Mus musculus)
Abbvie
Curated by ChEMBL
LigandPNGBDBM50566082(CHEMBL4779359)
Affinity DataIC50:  128nM. Assay description: Inhibition of TNFalpha in mouse L929 cells exposed to compound incubated for 1 hr with mouse TNFalpha by luminescence based assay
Ligand InfoPC cidPC sidPDB
In DepthDetails ArticlePubMed
TargetTumor necrosis factor(Homo sapiens (Human))
Abbvie
Curated by ChEMBL
LigandPNGBDBM50566082(CHEMBL4779359)
Affinity DataIC50:  29nM. Assay description: Inhibition of probe-5 binding to human TNFalpha (77 to 233 residues) at 1 nM by fluorescence polarization assay
Ligand InfoPC cidPC sidPDB