BDBM50567430 CHEMBL4860756
SMILES CC(C)C[C@@H]1NC(=O)[C@H](CCC(O)=O)NC(=O)[C@@H]2CCCN2C(=O)[C@H](Cc2cnc[nH]2)NC(=O)[C@H](CCCNC(N)=N)NC(=O)[C@@H](NC(=O)[C@H](Cc2cnc[nH]2)NC(=O)[C@@H]2CSSC[C@H](NC(=O)CN)C(=O)N[C@@H](CSSC[C@H](NC1=O)C(N)=O)C(=O)N[C@@H](CO)C(=O)N[C@@H](Cc1cnc[nH]1)C(=O)N1CCC[C@H]1C(=O)N[C@@H](C(C)C)C(=O)N2)C(C)C
InChI Key InChIKey=GUBZKNSUJVFLNU-SKAFCOJJSA-N
Data  2 IC50
  Tab Delimited (TSV)   2D SDfile   Computed 3D by Vconf -m prep SDfile
Find this compound or compounds like it in BindingDB:
Activity Spreadsheet -- Enzyme Inhibition Constant Data from BindingDB
Found 2 hits for monomerid = 50567430
TargetNeuronal acetylcholine receptor subunit alpha-3/alpha-6/beta-4(Rattus norvegicus (Rat))
Veterans Affairs Medical Center
Curated by ChEMBL
LigandPNGBDBM50567430(CHEMBL4860756)
Affinity DataIC50:  1.70nM. Assay description: Inhibition of rat alpha6/alpha3beta4 nAChR expressed in Xenopus laevis oocytes assessed as inhibition of acetylcholine-induced current response measu...
Ligand InfoPC cidPC sid
In DepthDetails ArticlePubMed
TargetNeuronal acetylcholine receptor subunit alpha-3/alpha-6/beta-4(Homo sapiens (Human))
Veterans Affairs Medical Center
Curated by ChEMBL
LigandPNGBDBM50567430(CHEMBL4860756)
Affinity DataIC50:  0.240nM. Assay description: Inhibition of human alpha6/alpha3beta4 nAChR expressed in Xenopus laevis oocytes assessed as inhibition of acetylcholine-induced current response mea...
Ligand InfoPC cidPC sid
In DepthDetails ArticlePubMed