BDBM50568397 CHEMBL4869600
SMILES Clc1ccc(cc1)C(=O)NC1(CCC1)c1ccc2N(CCc2n1)C(=O)OC1CC1
InChI Key InChIKey=ARMXVNONAUSRRZ-UHFFFAOYSA-N
Data  3 IC50
  Tab Delimited (TSV)   2D SDfile   Computed 3D by Vconf -m prep SDfile
Find this compound or compounds like it in BindingDB:
Activity Spreadsheet -- Enzyme Inhibition Constant Data from BindingDB
Found 3 hits for monomerid = 50568397
TargetIndoleamine 2,3-dioxygenase 1(Homo sapiens (Human))
Merck
Curated by ChEMBL
LigandPNGBDBM50568397(CHEMBL4869600)
Affinity DataIC50:  4.5nM. Assay description: Inhibition of human IDO1 in human Hela cells
Ligand InfoPC cidPC sid
In DepthDetails ArticlePubMed
TargetIndoleamine 2,3-dioxygenase 1(Homo sapiens (Human))
Merck
Curated by ChEMBL
LigandPNGBDBM50568397(CHEMBL4869600)
Affinity DataIC50:  0.630nM. Assay description: Inhibition of human IDO1 assessed as unbound compound concentration by human whole blood assay
Ligand InfoPC cidPC sid
In DepthDetails ArticlePubMed
TargetIndoleamine 2,3-dioxygenase 1(Homo sapiens (Human))
Merck
Curated by ChEMBL
LigandPNGBDBM50568397(CHEMBL4869600)
Affinity DataIC50:  63nM. Assay description: Inhibition of human IDO1 by human whole blood assay
Ligand InfoPC cidPC sid
In DepthDetails ArticlePubMed