BDBM50568480 CHEMBL4863099
SMILES OC(=O)CN(c1ccc(N(CC(O)=O)S(=O)(=O)c2ccc3OCOc3c2)c2ccccc12)S(=O)(=O)c1ccc2OCOc2c1
InChI Key InChIKey=QKEPIBLKFBKCOP-UHFFFAOYSA-N
Data  1 IC50
  Tab Delimited (TSV)   2D SDfile   Computed 3D by Vconf -m prep SDfile
Find this compound or compounds like it in BindingDB:
Activity Spreadsheet -- Enzyme Inhibition Constant Data from BindingDB
Found 1 hit for monomerid = 50568480
TargetNuclear factor erythroid 2-related factor 2(Homo sapiens (Human))
The State University Of New Jersey
Curated by ChEMBL
LigandPNGBDBM50568480(CHEMBL4863099)
Affinity DataIC50:  149nM. Assay description: Inhibition of recombinant human KEAP1 Kelch domain (321 to 609 residues) expressed in Escherichia coli BL21 (DE3)pLysS cells interaction with FITC-9m...
Ligand InfoPC cidPC sid
In DepthDetails ArticlePubMed