BDBM50568758 CHEMBL4864852
SMILES CC(NC(=O)\N=C(/N)NCCCc1sc(N)nc1C)c1ccccc1F
InChI Key InChIKey=AFEWMOFTNZUAGI-UHFFFAOYSA-N
Data  4 KI  1 EC50
  Tab Delimited (TSV)   2D SDfile   Computed 3D by Vconf -m prep SDfile
Find this compound or compounds like it in BindingDB:
Activity Spreadsheet -- Enzyme Inhibition Constant Data from BindingDB
Found 5 hits for monomerid = 50568758
TargetHistamine H2 receptor(Homo sapiens (Human))
University Of Regensburg
Curated by ChEMBL
LigandPNGBDBM50568758(CHEMBL4864852)
Affinity DataKi:  29nM. Assay description: Displacement of [3H]UR-DE257 from human histamine H2 receptor expressed in sf9 insect cell membranes co-expressing GSalphaS incubated for 60 mins by ...
Ligand InfoPC cidPC sid
In DepthDetails ArticlePubMed
TargetHistamine H4 receptor(Homo sapiens (Human))
University Of Regensburg
Curated by ChEMBL
LigandPNGBDBM50568758(CHEMBL4864852)
Affinity DataKi:  1.29E+4nM. Assay description: Displacement of [3H]histamine from human histamine H4 receptor expressed in sf9 insect cell membranes co-expressing Galphai2/Gbeta1gamma2 incubated f...
Ligand InfoPC cidPC sid
In DepthDetails ArticlePubMed
TargetHistamine H1 receptor(Homo sapiens (Human))
University Of Regensburg
Curated by ChEMBL
LigandPNGBDBM50568758(CHEMBL4864852)
Affinity DataKi:  1.70E+4nM. Assay description: Displacement of [3H]mepyramine from human histamine H1 receptor expressed in sf9 insect cell membranes co-expressing RGS4 incubated for 60 mins by mi...
Ligand InfoPC cidPC sid
In DepthDetails ArticlePubMed
TargetHistamine H3 receptor(Homo sapiens (Human))
University Of Regensburg
Curated by ChEMBL
LigandPNGBDBM50568758(CHEMBL4864852)
Affinity DataKi:  3.09E+4nM. Assay description: Displacement of [3H]UR-P129 from human histamine H3 receptor expressed in sf9 insect cell membranes co-expressing Galphai2/Gbeta1gamma2 incubated for...
Ligand InfoPC cidPC sid
In DepthDetails ArticlePubMed
TargetHistamine H2 receptor(Cavia porcellus (domestic guinea pig))
University Of Regensburg
Curated by ChEMBL
LigandPNGBDBM50568758(CHEMBL4864852)
Affinity DataEC50:  12nM. Assay description: Agonist activity at guinea pig right atrium histamine H2 receptor assessed as increase in heart rate incubated for 30 mins in presence of cimetidine
Ligand InfoPC cidPC sid
In DepthDetails ArticlePubMed