BDBM50568800 CHEMBL4859647
SMILES COc1cc2CC(CC3(F)CCN(Cc4ccccc4F)CC3)C(=O)c2cc1OC
InChI Key InChIKey=DCZOKUPYRTZAFN-UHFFFAOYSA-N
Data  10 IC50  1 Kd
PDB links: 1 PDB ID matches this monomer.
  Tab Delimited (TSV)   2D SDfile   Computed 3D by Vconf -m prep SDfile
Find this compound or compounds like it in BindingDB:
Activity Spreadsheet -- Enzyme Inhibition Constant Data from BindingDB
Found 11 hits for monomerid = 50568800
TargetAcetylcholinesterase(Rattus norvegicus (rat))
Chinese Academy Of Sciences
Curated by ChEMBL
LigandPNGBDBM50568800(CHEMBL4859647)
Affinity DataIC50:  0.860nM. Assay description: Inhibition of rat cortex homogenate acetylcholinesterase using acetylthiocholine iodide as substrate incubated for 20 mins by Ellman's method
Ligand InfoPC cidPC sidPDB
TargetAcetylcholinesterase(Homo sapiens (Human))
Chinese Academy Of Sciences
Curated by ChEMBL
LigandPNGBDBM50568800(CHEMBL4859647)
Affinity DataKd:  3.5nM. Assay description: Binding affinity to CM5 sensor chip immobilized recombinant human AChE assessed as dissociation constant at 298.15 K by surface plasmon resonance ass...
Ligand InfoPC cidPC sidPDB
TargetCarboxylic ester hydrolase(Rattus norvegicus (rat))
Chinese Academy Of Sciences
Curated by ChEMBL
LigandPNGBDBM50568800(CHEMBL4859647)
Affinity DataIC50:  3.17E+4nM. Assay description: Inhibition of rat serum BuChE using S-butyrylthiocholine iodide as substrate incubated for 8 mins by Ellman's method
Ligand InfoPC cidPC sidPDB
In DepthDetails ArticlePubMed
TargetPotassium voltage-gated channel subfamily H member 2(Homo sapiens (Human))
Chinese Academy Of Sciences
Curated by ChEMBL
LigandPNGBDBM50568800(CHEMBL4859647)
Affinity DataIC50:  9.23E+3nM. Assay description: Inhibition of human ERG
Ligand InfoPC cidPC sidPDB
In DepthDetails ArticlePubMed
TargetCytochrome P450 2C9(Homo sapiens (Human))
Chinese Academy Of Sciences
Curated by ChEMBL
LigandPNGBDBM50568800(CHEMBL4859647)
Affinity DataIC50:  4.77E+3nM. Assay description: Inhibition of CYP2C9 in human hepatocytes
Ligand InfoPC cidPC sidPDB
In DepthDetails ArticlePubMed
TargetCytochrome P450 3A4(Homo sapiens (Human))
Chinese Academy Of Sciences
Curated by ChEMBL
LigandPNGBDBM50568800(CHEMBL4859647)
Affinity DataIC50: >3.00E+4nM. Assay description: Inhibition of CYP3A4 in human hepatocytes
Ligand InfoPC cidPC sidPDB
In DepthDetails ArticlePubMed
TargetCytochrome P450 2B6(Homo sapiens (Human))
Chinese Academy Of Sciences
Curated by ChEMBL
LigandPNGBDBM50568800(CHEMBL4859647)
Affinity DataIC50: >3.00E+4nM. Assay description: Inhibition of CYP2B6 in human hepatocytes
Ligand InfoPC cidPC sidPDB
In DepthDetails ArticlePubMed
TargetCytochrome P450 2C8(Homo sapiens (Human))
Chinese Academy Of Sciences
Curated by ChEMBL
LigandPNGBDBM50568800(CHEMBL4859647)
Affinity DataIC50: >3.00E+4nM. Assay description: Inhibition of CYP2C8 in human hepatocytes
Ligand InfoPC cidPC sidPDB
In DepthDetails ArticlePubMed
TargetCytochrome P450 2C19(Homo sapiens (Human))
Chinese Academy Of Sciences
Curated by ChEMBL
LigandPNGBDBM50568800(CHEMBL4859647)
Affinity DataIC50: >3.00E+4nM. Assay description: Inhibition of CYP2C19 in human hepatocytes
Ligand InfoPC cidPC sidPDB
In DepthDetails ArticlePubMed
TargetCytochrome P450 2D6(Homo sapiens (Human))
Chinese Academy Of Sciences
Curated by ChEMBL
LigandPNGBDBM50568800(CHEMBL4859647)
Affinity DataIC50: >3.00E+4nM. Assay description: Inhibition of CYP2D6 in human hepatocytes
Ligand InfoPC cidPC sidPDB
In DepthDetails ArticlePubMed
TargetCytochrome P450 1A2(Homo sapiens (Human))
Chinese Academy Of Sciences
Curated by ChEMBL
LigandPNGBDBM50568800(CHEMBL4859647)
Affinity DataIC50: >3.00E+4nM. Assay description: Inhibition of CYP1A2 in human hepatocytes
Ligand InfoPC cidPC sidPDB
In DepthDetails ArticlePubMed