BDBM50570356 CHEMBL4864603
SMILES [H][C@]12C[C@@]3([H])C4=CCO[C@@]5([H])CC(=O)N6c7ccc(NC(=O)CCCCCCCCCCNC(=O)CCOCCOCCOCCOCCOCCOCCOCCOCCOCCOCCOCCOC)cc7[C@@]1(CCN2C4)[C@]6([H])[C@@]35[H]
InChI Key InChIKey=ZCWYMWXQUDCIMC-WFGRIKRVSA-N
Data  1 KI  6 IC50
  Tab Delimited (TSV)   2D SDfile   Computed 3D by Vconf -m prep SDfile
Find this compound or compounds like it in BindingDB:
Activity Spreadsheet -- Enzyme Inhibition Constant Data from BindingDB
Found 7 hits for monomerid = 50570356
TargetGlycine receptor subunit alpha-1(Homo sapiens (Human))
The German University In Cairo
Curated by ChEMBL
LigandPNGBDBM50570356(CHEMBL4864603)
Affinity DataKi:  977nM. Assay description: Displacement of [3H]strychnine from human glycine receptor subunit alpha-1 expressed in HEK293 cell membranes preincubated for 30 mins followed by [3...
Ligand InfoPC cidPC sid
In DepthDetails ArticlePubMed
TargetGlycine receptor subunit alpha-1(Homo sapiens (Human))
The German University In Cairo
Curated by ChEMBL
LigandPNGBDBM50570356(CHEMBL4864603)
Affinity DataIC50:  2.00E+4nM. Assay description: Antagonist activity at human glycine receptor subunit alpha-1 expressed in human tsA201 cells assessed as reduction in glycine-induced response incub...
Ligand InfoPC cidPC sid
In DepthDetails ArticlePubMed
TargetGlycine receptor subunit alpha-1/beta(Homo sapiens (Human))
The German University In Cairo
Curated by ChEMBL
LigandPNGBDBM50570356(CHEMBL4864603)
Affinity DataIC50:  1.00E+4nM. Assay description: Antagonist activity at human glycine receptor subunit alpha-1beta expressed in human tsA201 cells assessed as reduction in glycine-induced response i...
Ligand InfoPC cidPC sid
In DepthDetails ArticlePubMed
TargetGlycine receptor subunit alpha-1(Homo sapiens (Human))
The German University In Cairo
Curated by ChEMBL
LigandPNGBDBM50570356(CHEMBL4864603)
Affinity DataIC50:  158nM. Assay description: Antagonist activity at human glycine receptor subunit alpha-1 assessed as inhibition of glycine-induced current measured at the later state of compou...
Ligand InfoPC cidPC sid
In DepthDetails ArticlePubMed
TargetGlycine receptor subunit alpha-1(Homo sapiens (Human))
The German University In Cairo
Curated by ChEMBL
LigandPNGBDBM50570356(CHEMBL4864603)
Affinity DataIC50:  5.72E+3nM. Assay description: Antagonist activity at human glycine receptor subunit alpha-1 assessed as inhibition of glycine-induced current measured at the onset of compound app...
Ligand InfoPC cidPC sid
In DepthDetails ArticlePubMed
TargetGlycine receptor subunit alpha-1(Homo sapiens (Human))
The German University In Cairo
Curated by ChEMBL
LigandPNGBDBM50570356(CHEMBL4864603)
Affinity DataIC50:  2.00E+4nM. Assay description: Antagonist activity at human glycine receptor subunit alpha-1 expressed in human tsA201 cells assessed as reduction in glycine-induced response incub...
Ligand InfoPC cidPC sid
In DepthDetails ArticlePubMed
TargetGlycine receptor subunit alpha-1/beta(Homo sapiens (Human))
The German University In Cairo
Curated by ChEMBL
LigandPNGBDBM50570356(CHEMBL4864603)
Affinity DataIC50:  1.00E+4nM. Assay description: Antagonist activity at human glycine receptor subunit alpha-1beta expressed in human tsA201 cells assessed as reduction in glycine-induced response i...
Ligand InfoPC cidPC sid
In DepthDetails ArticlePubMed