BDBM50571570 CHEMBL4876211
SMILES Cn1c(Cl)cnc1CNc1ccc2sncc2c1
InChI Key InChIKey=CSSDJSDSVXAGMG-UHFFFAOYSA-N
Data  7 EC50
  Tab Delimited (TSV)   2D SDfile   Computed 3D by Vconf -m prep SDfile
Find this compound or compounds like it in BindingDB:
Activity Spreadsheet -- Enzyme Inhibition Constant Data from BindingDB
Found 7 hits for monomerid = 50571570
TargetTransient receptor potential cation channel subfamily A member 1(Homo sapiens (Human))
Aptuit, An Evotec
Curated by ChEMBL
LigandPNGBDBM50571570(CHEMBL4876211)
Affinity DataEC50: <1.58E+4nM. Assay description: Agonist activity at human TRPA1 expressed in HEK cells assessed as increase in menthol-induced intracellular calcium level incubated for 2 hrs by FLI...
Ligand InfoPC cidPC sid
In DepthDetails ArticlePubMed
TargetTransient receptor potential cation channel subfamily V member 4(Homo sapiens (Human))
Aptuit, An Evotec
Curated by ChEMBL
LigandPNGBDBM50571570(CHEMBL4876211)
Affinity DataEC50: <1.58E+4nM. Assay description: Agonist activity at human TRPV4 expressed in HEK cells assessed as increase in GSK1016790A-induced intracellular calcium level measured after 1 hr by...
Ligand InfoPC cidPC sid
In DepthDetails ArticlePubMed
TargetTransient receptor potential cation channel subfamily V member 1(Homo sapiens (Human))
Aptuit, An Evotec
Curated by ChEMBL
LigandPNGBDBM50571570(CHEMBL4876211)
Affinity DataEC50: <1.58E+4nM. Assay description: Agonist activity at human TRPV1 expressed in CHO cells assessed as increase in capsaicin-induced intracellular calcium level measured after 1 hr by F...
Ligand InfoPC cidPC sid
In DepthDetails ArticlePubMed
TargetTransient receptor potential cation channel subfamily M member 4(Homo sapiens)
Aptuit, An Evotec
Curated by ChEMBL
LigandPNGBDBM50571570(CHEMBL4876211)
Affinity DataEC50: <6.31E+4nM. Assay description: Agonist activity at human TRPM4 expressed in CHO cells assessed as increase in A23187-induced intracellular calcium level by FLIPR assay
Ligand InfoPC cidPC sid
In DepthDetails ArticlePubMed
TargetTransient receptor potential cation channel subfamily M member 5(Homo sapiens (Human))
Aptuit, An Evotec
Curated by ChEMBL
LigandPNGBDBM50571570(CHEMBL4876211)
Affinity DataEC50:  331nM. Assay description: Agonist activity at human TRPM5 expressed in CHO-K1 cells maintained at 80 mV final holding potential by syncroPatch assay
Ligand InfoPC cidPC sid
In DepthDetails ArticlePubMed
TargetTransient receptor potential cation channel subfamily M member 5(Mus musculus)
Aptuit, An Evotec
Curated by ChEMBL
LigandPNGBDBM50571570(CHEMBL4876211)
Affinity DataEC50:  891nM. Assay description: Agonist activity at mouse TRPM5 expressed in CHO-K1 cells maintained at 80 mV final holding potential by syncroPatch assay
Ligand InfoPC cidPC sid
In DepthDetails ArticlePubMed
TargetTransient receptor potential cation channel subfamily M member 8(Homo sapiens (Human))
Aptuit, An Evotec
Curated by ChEMBL
LigandPNGBDBM50571570(CHEMBL4876211)
Affinity DataEC50: <1.58E+4nM. Assay description: Agonist activity at human TRPM8 expressed in HEK cells assessed as increase in menthol-induced intracellular calcium level measured after 1 hr by FLI...
Ligand InfoPC cidPC sid
In DepthDetails ArticlePubMed