BDBM50571575 CHEMBL4858947
SMILES COc1ccc(cc1OC)N(C)Cc1ncc(Cl)n1C
InChI Key InChIKey=YIMJWDWMBGQBTN-UHFFFAOYSA-N
Data  1 EC50
  Tab Delimited (TSV)   2D SDfile   Computed 3D by Vconf -m prep SDfile
Find this compound or compounds like it in BindingDB:
Activity Spreadsheet -- Enzyme Inhibition Constant Data from BindingDB
Found 1 hit for monomerid = 50571575
TargetTransient receptor potential cation channel subfamily M member 5(Homo sapiens (Human))
Aptuit, An Evotec
Curated by ChEMBL
LigandPNGBDBM50571575(CHEMBL4858947)
Affinity DataEC50: <3.16E+4nM. Assay description: Agonist activity at human TRPM5 expressed in CHO-K1 cells maintained at 80 mV final holding potential by syncroPatch assay
Ligand InfoPC cidPC sid
In DepthDetails ArticlePubMed