BDBM50571617 CHEMBL4860824
SMILES Cc1cc2sncc2cc1NCc1ncc(Cl)s1
InChI Key InChIKey=KDJXXRCZWSZKLV-UHFFFAOYSA-N
Data  1 EC50
  Tab Delimited (TSV)   2D SDfile   Computed 3D by Vconf -m prep SDfile
Find this compound or compounds like it in BindingDB:
Activity Spreadsheet -- Enzyme Inhibition Constant Data from BindingDB
Found 1 hit for monomerid = 50571617
TargetTransient receptor potential cation channel subfamily M member 5(Homo sapiens (Human))
Aptuit, An Evotec
Curated by ChEMBL
LigandPNGBDBM50571617(CHEMBL4860824)
Affinity DataEC50:  39nM. Assay description: Agonist activity at human TRPM5 expressed in CHO-K1 cells maintained at 80 mV final holding potential by syncroPatch assay
Ligand InfoPC cidPC sid
In DepthDetails ArticlePubMed