BDBM50571633 CHEMBL4871607
SMILES Clc1cnc(CNc2cccc3cnsc23)s1
InChI Key InChIKey=LNBYWRBOEGWQIL-UHFFFAOYSA-N
Data  1 EC50
  Tab Delimited (TSV)   2D SDfile   Computed 3D by Vconf -m prep SDfile
Find this compound or compounds like it in BindingDB:
Activity Spreadsheet -- Enzyme Inhibition Constant Data from BindingDB
Found 1 hit for monomerid = 50571633
TargetTransient receptor potential cation channel subfamily M member 5(Homo sapiens (Human))
Aptuit, An Evotec
Curated by ChEMBL
LigandPNGBDBM50571633(CHEMBL4871607)
Affinity DataEC50:  1.45E+3nM. Assay description: Agonist activity at human TRPM5 expressed in CHO-K1 cells maintained at 80 mV final holding potential by syncroPatch assay
Ligand InfoPC cidPC sid
In DepthDetails ArticlePubMed