BDBM50571639 CHEMBL4862183
SMILES Cn1c(Cl)cnc1CNc1cc2sncc2cc1F
InChI Key InChIKey=GGKJZPQKGGSLMB-UHFFFAOYSA-N
Data  1 EC50
  Tab Delimited (TSV)   2D SDfile   Computed 3D by Vconf -m prep SDfile
Find this compound or compounds like it in BindingDB:
Activity Spreadsheet -- Enzyme Inhibition Constant Data from BindingDB
Found 1 hit for monomerid = 50571639
TargetTransient receptor potential cation channel subfamily M member 5(Homo sapiens (Human))
Aptuit, An Evotec
Curated by ChEMBL
LigandPNGBDBM50571639(CHEMBL4862183)
Affinity DataEC50:  102nM. Assay description: Agonist activity at human TRPM5 expressed in CHO-K1 cells maintained at 80 mV final holding potential by syncroPatch assay
Ligand InfoPC cidPC sid
In DepthDetails ArticlePubMed