BDBM50572161 CHEMBL1520238
SMILES Brc1ccc(CSc2nccn2-c2ccccc2)cc1
InChI Key InChIKey=FWQUGMKGRHUQAN-UHFFFAOYSA-N
Data  1 KI  7 IC50  1 EC50
  Tab Delimited (TSV)   2D SDfile   Computed 3D by Vconf -m prep SDfile
Find this compound or compounds like it in BindingDB:
Activity Spreadsheet -- Enzyme Inhibition Constant Data from BindingDB
Found 9 hits for monomerid = 50572161
TargetPolyunsaturated fatty acid lipoxygenase ALOX15B(Homo sapiens (Human))
University Of California Santa Cruz
Curated by ChEMBL
LigandPNGBDBM50572161(CHEMBL1520238)
Affinity DataKi:  800nM. Assay description: Competitive inhibition of human 15-LOX-2 assessed as equilibrium dissociation constant from catalytic site by measuring 15-HpETE by Dixon plots and D...
Ligand InfoPC cidPC sid
In DepthDetails ArticlePubMed
TargetPolyunsaturated fatty acid lipoxygenase ALOX15(Homo sapiens (Human))
University Of California Santa Cruz
Curated by ChEMBL
LigandPNGBDBM50572161(CHEMBL1520238)
Affinity DataIC50: >5.00E+4nM. Assay description: Inhibition of human 15-LOX-1 assessed as enzymatic rate using arachidonic acid as substrate by UV/Vis spectrophotometric analysis
Ligand InfoPC cidPC sid
In DepthDetails ArticlePubMed
TargetPolyunsaturated fatty acid lipoxygenase ALOX12(Homo sapiens (Human))
University Of California Santa Cruz
Curated by ChEMBL
LigandPNGBDBM50572161(CHEMBL1520238)
Affinity DataIC50: >1.00E+5nM. Assay description: Inhibition of human 12-LOX assessed as enzymatic rate using arachidonic acid as substrate by UV/Vis spectrophotometric analysis
Ligand InfoPC cidPC sid
In DepthDetails ArticlePubMed
TargetPolyunsaturated fatty acid lipoxygenase ALOX15B(Homo sapiens (Human))
University Of California Santa Cruz
Curated by ChEMBL
LigandPNGBDBM50572161(CHEMBL1520238)
Affinity DataEC50:  3.10E+4nM. Assay description: Inhibition of human 15-LOX-2 expressed in HEK293T cells assessed as a reduction in 15-HETE production using arachidonic acid as substrate incubated f...
Ligand InfoPC cidPC sid
In DepthDetails ArticlePubMed
TargetPolyunsaturated fatty acid lipoxygenase ALOX8(Mus musculus)
University Of California Santa Cruz
Curated by ChEMBL
LigandPNGBDBM50572161(CHEMBL1520238)
Affinity DataIC50: >5.00E+4nM. Assay description: Inhibition of mouse 15-LOX2 assessed as enzymatic rate using arachidonic acid as substrate by UV/Vis spectrophotometric analysis
Ligand InfoPC cidPC sid
In DepthDetails ArticlePubMed
TargetProstaglandin G/H synthase 1(Homo sapiens (Human))
University Of California Santa Cruz
Curated by ChEMBL
LigandPNGBDBM50572161(CHEMBL1520238)
Affinity DataIC50: >1.00E+5nM. Assay description: Inhibition of human recombinant COX-1 assessed as enzymatic rate using arachidonic acid as substrate by UV/Vis spectrophotometric analysis
Ligand InfoPC cidPC sid
In DepthDetails ArticlePubMed
TargetProstaglandin G/H synthase 2(Homo sapiens (Human))
University Of California Santa Cruz
Curated by ChEMBL
LigandPNGBDBM50572161(CHEMBL1520238)
Affinity DataIC50: >1.00E+5nM. Assay description: Inhibition of human recombinant COX-2 assessed as enzymatic rate using arachidonic acid as substrate by UV/Vis spectrophotometric analysis
Ligand InfoPC cidPC sid
In DepthDetails ArticlePubMed
TargetPolyunsaturated fatty acid lipoxygenase ALOX15B(Homo sapiens (Human))
University Of California Santa Cruz
Curated by ChEMBL
LigandPNGBDBM50572161(CHEMBL1520238)
Affinity DataIC50:  530nM. Assay description: Inhibition of human 15-LOX-2 assessed as enzymatic rate using arachidonic acid as substrate by UV/Vis spectrophotometric analysis
Ligand InfoPC cidPC sid
In DepthDetails ArticlePubMed
TargetPolyunsaturated fatty acid 5-lipoxygenase(Homo sapiens (Human))
University Of California Santa Cruz
Curated by ChEMBL
LigandPNGBDBM50572161(CHEMBL1520238)
Affinity DataIC50: >1.00E+5nM. Assay description: Inhibition of human 5-LOX assessed as enzymatic rate using arachidonic acid as substrate by UV/Vis spectrophotometric analysis
Ligand InfoPC cidPC sid
In DepthDetails ArticlePubMed