BDBM50572463 CHEMBL4871101
SMILES CC(C)CCn1c(CN2C(=O)C3(CC3)c3cccnc23)nc2cc(CN)ccc12
InChI Key InChIKey=QVISTKCFDABZAC-UHFFFAOYSA-N
Data  1 IC50
  Tab Delimited (TSV)   2D SDfile   Computed 3D by Vconf -m prep SDfile
Find this compound or compounds like it in BindingDB:
Activity Spreadsheet -- Enzyme Inhibition Constant Data from BindingDB
Found 1 hit for monomerid = 50572463
TargetFusion glycoprotein F0(Human respiratory syncytial virus A (strain A2))
Reviral
Curated by ChEMBL
LigandPNGBDBM50572463(CHEMBL4871101)
Affinity DataIC50:  0.900nM. Assay description: Inhibition of Respiratory syncytial virus fusion protein
Ligand InfoPC cidPC sid
In DepthDetails ArticlePubMed