BDBM50575244 CHEMBL4851857
SMILES [H][C@]12C[C@@]1([H])c1c(C2)n(CC(=O)N2CCN(CC2)c2cccc(C)c2C)nc1C(=O)N1CCC(CC1)OCCO
InChI Key InChIKey=AUNDCQZYBPUZKC-FYYLOGMGSA-N
Data  1 IC50
  Tab Delimited (TSV)   2D SDfile   Computed 3D by Vconf -m prep SDfile
Find this compound or compounds like it in BindingDB:
Activity Spreadsheet -- Enzyme Inhibition Constant Data from BindingDB
Found 1 hit for monomerid = 50575244
TargetIndoleamine 2,3-dioxygenase 1(Homo sapiens (Human))
Smith, Gambrell & Russell
Curated by ChEMBL
LigandPNGBDBM50575244(CHEMBL4851857)
Affinity DataIC50: <0.510nM. Assay description: Inhibition of IDO1 in IFN-gamma stimulated human HeLa cells incubated for 48 hrs by fluorescence microplate reader assay
In DepthDetails ArticlePubMed