BDBM50575574 CHEMBL4852740
SMILES NS(=O)(=O)OC[C@H]1C[C@H](C[C@@H]1O)Nc1ncncc1C(=O)c1ccn(Cc2ccc(Cl)s2)n1
InChI Key InChIKey=OMEJZYALSBXTSP-HSMVNMDESA-N
Data  3 IC50
  Tab Delimited (TSV)   2D SDfile   Computed 3D by Vconf -m prep SDfile
Find this compound or compounds like it in BindingDB:
Activity Spreadsheet -- Enzyme Inhibition Constant Data from BindingDB
Found 3 hits for monomerid = 50575574
TargetSUMO-activating enzyme subunit 1/2(Homo sapiens (Human))
Millennium Pharmaceuticals, A Wholly Owned Subsidiary Of Takeda Pharmaceuticals
Curated by ChEMBL
LigandPNGBDBM50575574(CHEMBL4852740)
Affinity DataIC50:  2nM. Assay description: Inhibition of recombinant SAE (unknown origin) assessed as reduction in transfer of SUMO1 to UBC9 using SUMO1 as a substrate in presence of ATP at Km...
Ligand InfoPC cidPC sid
In DepthDetails ArticlePubMed
TargetSUMO-activating enzyme subunit 1/2(Homo sapiens (Human))
Millennium Pharmaceuticals, A Wholly Owned Subsidiary Of Takeda Pharmaceuticals
Curated by ChEMBL
LigandPNGBDBM50575574(CHEMBL4852740)
Affinity DataIC50:  228nM. Assay description: Inhibition of SAE in human HCT116 cells assessed as reduction in redistribution of SUMO2/3 proteins from nucleus to cytosol incubated for 4 hrs by im...
Ligand InfoPC cidPC sid
In DepthDetails ArticlePubMed
TargetNEDD8-activating enzyme E1 catalytic subunit(Homo sapiens)
Millennium Pharmaceuticals, A Wholly Owned Subsidiary Of Takeda Pharmaceuticals
Curated by ChEMBL
LigandPNGBDBM50575574(CHEMBL4852740)
Affinity DataIC50:  353nM. Assay description: Inhibition of recombinant NAE (unknown origin) in presence of ATP at Km concentration by HTRF assay
Ligand InfoPC cidPC sid
In DepthDetails ArticlePubMed