BDBM50575592 CHEMBL4860917
SMILES CC(N)(c1csc(c1)C(=O)c1cncnc1N[C@H]1C[C@H](O)[C@@H](COS(N)(=O)=O)C1)c1cccc(Cl)c1
InChI Key InChIKey=BYYBSAXSQZOPPS-OZIPQWNZSA-N
Data  5 IC50
  Tab Delimited (TSV)   2D SDfile   Computed 3D by Vconf -m prep SDfile
Find this compound or compounds like it in BindingDB:
Activity Spreadsheet -- Enzyme Inhibition Constant Data from BindingDB
Found 5 hits for monomerid = 50575592
TargetSUMO-activating enzyme subunit 1/2(Homo sapiens (Human))
Millennium Pharmaceuticals, A Wholly Owned Subsidiary Of Takeda Pharmaceuticals
Curated by ChEMBL
LigandPNGBDBM50575592(CHEMBL4860917)
Affinity DataIC50:  0.300nM. Assay description: Inhibition of recombinant SAE (unknown origin) assessed as reduction in transfer of SUMO1 to UBC9 using SUMO1 as a substrate in presence of ATP at Km...
Ligand InfoPC cidPC sid
In DepthDetails ArticlePubMed
TargetNEDD8-activating enzyme E1 catalytic subunit(Homo sapiens)
Millennium Pharmaceuticals, A Wholly Owned Subsidiary Of Takeda Pharmaceuticals
Curated by ChEMBL
LigandPNGBDBM50575592(CHEMBL4860917)
Affinity DataIC50: >1.00E+3nM. Assay description: Inhibition of recombinant NAE (unknown origin) in presence of ATP at Km concentration by HTRF assay
Ligand InfoPC cidPC sid
In DepthDetails ArticlePubMed
TargetSUMO-activating enzyme subunit 1/2(Homo sapiens (Human))
Millennium Pharmaceuticals, A Wholly Owned Subsidiary Of Takeda Pharmaceuticals
Curated by ChEMBL
LigandPNGBDBM50575592(CHEMBL4860917)
Affinity DataIC50:  101nM. Assay description: Inhibition of SAE in human HCT116 cells assessed as redistribution of SUMO2/3 proteins from nucleus to cytosol preincubated for 2 hrs followed by com...
Ligand InfoPC cidPC sid
In DepthDetails ArticlePubMed
TargetSUMO-activating enzyme subunit 1/2(Homo sapiens (Human))
Millennium Pharmaceuticals, A Wholly Owned Subsidiary Of Takeda Pharmaceuticals
Curated by ChEMBL
LigandPNGBDBM50575592(CHEMBL4860917)
Affinity DataIC50:  29nM. Assay description: Inhibition of SAE in human HCT116 cells assessed as redistribution of SUMO2/3 proteins from nucleus to cytosol preincubated for 2 hrs followed by com...
Ligand InfoPC cidPC sid
In DepthDetails ArticlePubMed
TargetSUMO-activating enzyme subunit 1/2(Homo sapiens (Human))
Millennium Pharmaceuticals, A Wholly Owned Subsidiary Of Takeda Pharmaceuticals
Curated by ChEMBL
LigandPNGBDBM50575592(CHEMBL4860917)
Affinity DataIC50:  16nM. Assay description: Inhibition of SAE in human HCT116 cells assessed as reduction in redistribution of SUMO2/3 proteins from nucleus to cytosol incubated for 4 hrs by im...
Ligand InfoPC cidPC sid
In DepthDetails ArticlePubMed