BDBM50579671 CHEMBL5090959
SMILES C[C@@H](C1CC1)N1Cc2cc(cc(c2C1=O)S(C)(=O)=O)-c1sc(Nc2cccc(n2)-c2ocnc2CO)nc1C
InChI Key InChIKey=YKKDQSUXCTZICT-HNNXBMFYSA-N
Data  2 IC50
  Tab Delimited (TSV)   2D SDfile   Computed 3D by Vconf -m prep SDfile
Find this compound or compounds like it in BindingDB:
Activity Spreadsheet -- Enzyme Inhibition Constant Data from BindingDB
Found 2 hits for monomerid = 50579671
LigandPNGBDBM50579671(CHEMBL5090959)
Affinity DataIC50:  2nM. Assay description: Inhibition of recombinant human PI3Kdelta assessed as reduction in ADP production using Dic8-PIP2 as substrate pre-treated for 15 mins followed by su...
Ligand InfoPC cidPC sid
In DepthDetails ArticlePubMed
LigandPNGBDBM50579671(CHEMBL5090959)
Affinity DataIC50:  0.631nM. Assay description: Inhibition of recombinant human PI3Kgamma assessed as reduction in ADP production using Dic8-PIP2 as substrate pre-treated for 15 mins followed by su...
Ligand InfoPC cidPC sid
In DepthDetails ArticlePubMed