BDBM50581147 CHEMBL5094242
SMILES CN(C)C(=O)c1ccc(cc1)-c1cc(Nc2ncnc(Cl)c2N)c(cc1F)N1CCN(C)CC1
InChI Key InChIKey=LXONEMNSYOAQJT-UHFFFAOYSA-N
Data  7 IC50  1 Kd
  Tab Delimited (TSV)   2D SDfile   Computed 3D by Vconf -m prep SDfile
Find this compound or compounds like it in BindingDB:
Activity Spreadsheet -- Enzyme Inhibition Constant Data from BindingDB
Found 8 hits for monomerid = 50581147
TargetHistone-lysine N-methyltransferase 2A(Homo sapiens (Human))
China Pharmaceutical University
Curated by ChEMBL
LigandPNGBDBM50581147(CHEMBL5094242)
Affinity DataIC50:  780nM. Assay description: Inhibition of MLL1 (unknown origin) histamine methyltransferase activity assessed as inhibition of H3K4 methylation incubated for 30 mins by Alphascr...
Ligand InfoPC cidPC sid
In DepthDetails ArticlePubMed
TargetWD repeat-containing protein 5(Homo sapiens (Human))
China Pharmaceutical University
Curated by ChEMBL
LigandPNGBDBM50581147(CHEMBL5094242)
Affinity DataKd:  73nM. Assay description: Binding affinity to WDR5 (unknown origin) by isothermal titration calorimetry assay
Ligand InfoPC cidPC sid
In DepthDetails ArticlePubMed
TargetHistone-lysine N-methyltransferase EHMT2(Homo sapiens (Human))
China Pharmaceutical University
Curated by ChEMBL
LigandPNGBDBM50581147(CHEMBL5094242)
Affinity DataIC50: >1.00E+5nM. Assay description: Inhibition of G9a (unknown origin) assessed as effect on H3K9 methylation incubated for 30 mins by Alphascreen assay
Ligand InfoPC cidPC sid
In DepthDetails ArticlePubMed
TargetWD repeat-containing protein 5(Homo sapiens (Human))
China Pharmaceutical University
Curated by ChEMBL
LigandPNGBDBM50581147(CHEMBL5094242)
Affinity DataIC50:  29nM. Assay description: Binding affinity to WDR5 (unknown origin) fluorescence polarization assay
Ligand InfoPC cidPC sid
In DepthDetails PubMed
TargetHistone-lysine N-methyltransferase EZH2(Homo sapiens (Human))
China Pharmaceutical University
Curated by ChEMBL
LigandPNGBDBM50581147(CHEMBL5094242)
Affinity DataIC50: >1.00E+5nM. Assay description: Inhibition of EZH2 (unknown origin) assessed as effect on H3K27 methylation incubated for 30 mins by Alphascreen assay
Ligand InfoPC cidPC sid
In DepthDetails ArticlePubMed
TargetN-lysine methyltransferase KMT5A(Homo sapiens (Human))
China Pharmaceutical University
Curated by ChEMBL
LigandPNGBDBM50581147(CHEMBL5094242)
Affinity DataIC50: >1.00E+5nM. Assay description: Inhibition of SET8 (unknown origin) assessed as effect on H4K20 methylation incubated for 30 mins by Alphascreen assay
Ligand InfoPC cidPC sid
In DepthDetails ArticlePubMed
TargetProtein arginine N-methyltransferase 5(Homo sapiens (Human))
China Pharmaceutical University
Curated by ChEMBL
LigandPNGBDBM50581147(CHEMBL5094242)
Affinity DataIC50: >1.00E+5nM. Assay description: Inhibition of PRMT5 (unknown origin) assessed as effect on H3R8/H4R3 methylation incubated for 30 mins by Alphascreen assay
Ligand InfoPC cidPC sid
In DepthDetails ArticlePubMed
TargetHistone-lysine N-methyltransferase, H3 lysine-79 specific(Homo sapiens (Human))
China Pharmaceutical University
Curated by ChEMBL
LigandPNGBDBM50581147(CHEMBL5094242)
Affinity DataIC50: >1.00E+5nM. Assay description: Inhibition of DOT1L (unknown origin) assessed as effect on H3K79 methylation incubated for 30 mins by Alphascreen assay
Ligand InfoPC cidPC sid
In DepthDetails ArticlePubMed