BDBM50581384 CHEMBL5085455
SMILES CN1[C@@H](Cc2ccccc2)C(=O)N[C@@H](CC(=O)NCCCC[C@@H](NC(=O)[C@@H](N)Cc2ccc(O)cc2)C(=O)NCC1=O)C(=O)N1CCC[C@H]1C(=O)N[C@@H](CCC(N)=O)C(=O)N[C@@H](CCCNC(N)=N)C(=O)N[C@@H](Cc1ccccc1)C(N)=O
InChI Key InChIKey=GSGQKVJVZLVGIE-MQRRDULVSA-N
Data  10 EC50
  Tab Delimited (TSV)   2D SDfile   Computed 3D by Vconf -m prep SDfile
Find this compound or compounds like it in BindingDB:
Activity Spreadsheet -- Enzyme Inhibition Constant Data from BindingDB
Found 10 hits for monomerid = 50581384
TargetMu-type opioid receptor(Homo sapiens (Human))
Lanzhou University
Curated by ChEMBL
LigandPNGBDBM50581384(CHEMBL5085455)
Affinity DataEC50:  94nM. Assay description: Agonist activity at MOR (unknown origin) expressed in HEK293-A cells assessed as inhibition of forskolin-induced cAMP accumulation preincubated for 3...
Ligand InfoPC cidPC sid
In DepthDetails ArticlePubMed
TargetMu-type opioid receptor(Homo sapiens (Human))
Lanzhou University
Curated by ChEMBL
LigandPNGBDBM50581384(CHEMBL5085455)
Affinity DataEC50:  93nM. Assay description: Agonist activity at MOR (unknown origin) expressed in HEK293-A cells assessed as inhibition of forskolin-induced cAMP accumulation preincubated for 3...
Ligand InfoPC cidPC sid
In DepthDetails ArticlePubMed
TargetKappa-type opioid receptor(Homo sapiens (Human))
Lanzhou University
Curated by ChEMBL
LigandPNGBDBM50581384(CHEMBL5085455)
Affinity DataEC50:  39nM. Assay description: Agonist activity at KOR (unknown origin) expressed in HEK293-A cells assessed as inhibition of forskolin-induced cAMP accumulation preincubated for 3...
Ligand InfoPC cidPC sid
In DepthDetails ArticlePubMed
TargetKappa-type opioid receptor(Homo sapiens (Human))
Lanzhou University
Curated by ChEMBL
LigandPNGBDBM50581384(CHEMBL5085455)
Affinity DataEC50:  39nM. Assay description: Agonist activity at KOR (unknown origin) expressed in HEK293-A cells assessed as inhibition of forskolin-induced cAMP accumulation preincubated for 3...
Ligand InfoPC cidPC sid
In DepthDetails ArticlePubMed
TargetNeuropeptide FF receptor 2(Homo sapiens (Human))
Lanzhou University
Curated by ChEMBL
LigandPNGBDBM50581384(CHEMBL5085455)
Affinity DataEC50:  50nM. Assay description: Agonist activity at NPFF2R (unknown origin) expressed in HEK293-A cells assessed as inhibition of forskolin-induced cAMP accumulation preincubated fo...
Ligand InfoPC cidPC sid
In DepthDetails ArticlePubMed
TargetDelta-type opioid receptor(Homo sapiens (Human))
Lanzhou University
Curated by ChEMBL
LigandPNGBDBM50581384(CHEMBL5085455)
Affinity DataEC50:  546nM. Assay description: Agonist activity at DOR (unknown origin) expressed in HEK293-A cells assessed as inhibition of forskolin-induced cAMP accumulation preincubated for 3...
Ligand InfoPC cidPC sid
In DepthDetails ArticlePubMed
TargetNeuropeptide FF receptor 1(Homo sapiens (Human))
Lanzhou University
Curated by ChEMBL
LigandPNGBDBM50581384(CHEMBL5085455)
Affinity DataEC50:  575nM. Assay description: Agonist activity at NPFF1R (unknown origin) expressed in HEK293-A cells assessed as inhibition of forskolin-induced cAMP accumulation preincubated fo...
Ligand InfoPC cidPC sid
In DepthDetails ArticlePubMed
TargetNeuropeptide FF receptor 1(Homo sapiens (Human))
Lanzhou University
Curated by ChEMBL
LigandPNGBDBM50581384(CHEMBL5085455)
Affinity DataEC50:  580nM. Assay description: Agonist activity at NPFF1R (unknown origin) expressed in HEK293-A cells assessed as inhibition of forskolin-induced cAMP accumulation preincubated fo...
Ligand InfoPC cidPC sid
In DepthDetails ArticlePubMed
TargetNeuropeptide FF receptor 2(Homo sapiens (Human))
Lanzhou University
Curated by ChEMBL
LigandPNGBDBM50581384(CHEMBL5085455)
Affinity DataEC50:  50nM. Assay description: Agonist activity at NPFF2R (unknown origin) expressed in HEK293-A cells assessed as inhibition of forskolin-induced cAMP accumulation preincubated fo...
Ligand InfoPC cidPC sid
In DepthDetails ArticlePubMed
TargetDelta-type opioid receptor(Homo sapiens (Human))
Lanzhou University
Curated by ChEMBL
LigandPNGBDBM50581384(CHEMBL5085455)
Affinity DataEC50:  550nM. Assay description: Agonist activity at DOR (unknown origin) expressed in HEK293-A cells assessed as inhibition of forskolin-induced cAMP accumulation preincubated for 3...
Ligand InfoPC cidPC sid
In DepthDetails ArticlePubMed