BDBM50582057 CHEMBL5077579
SMILES CC[C@H](C)[C@@H]1NC(=O)[C@H](CSSC[C@@H]2NC(=O)[C@@H]3CSSC[C@H](NC(=O)[C@H](CCCCN)NC(=O)[C@H](Cc4ccccc4)NC(=O)[C@H](CC(N)=O)NC(=O)[C@H](Cc4c[nH]c5ccccc45)NC(=O)CNC(=O)[C@H](CSSC[C@H](NC(=O)[C@H](Cc4ccccc4)NC(=O)[C@H](CO)NC(=O)CNC(=O)[C@@H](NC(=O)[C@H](CO)NC1=O)[C@@H](C)O)C(=O)N[C@@H]([C@@H](C)O)C(=O)N[C@@H](CC(C)C)C(=O)N[C@@H](CO)C(=O)N[C@@H](CCCCN)C(=O)NCC(=O)N3)NC(=O)[C@H](CC(N)=O)NC(=O)[C@H](CCCCN)NC(=O)[C@@H](NC2=O)[C@@H](C)O)C(=O)N[C@@H](CC(N)=O)C(=O)N1C[C@@H](O)C[C@H]1C(=O)N1C[C@@H](O)C[C@H]1C(=O)N[C@@H](CC(N)=O)C(=O)N[C@@H](CCC(N)=O)C(O)=O)NC(=O)CN
InChI Key InChIKey=IOVQSRHHCJTBSI-STUJECSISA-N
Data  7 EC50
  Tab Delimited (TSV)   2D SDfile   Computed 3D by Vconf -m prep SDfile
Find this compound or compounds like it in BindingDB:
Activity Spreadsheet -- Enzyme Inhibition Constant Data from BindingDB
Found 7 hits for monomerid = 50582057
TargetSodium channel protein type 1 subunit alpha(Homo sapiens (Human))
Uppsala University
Curated by ChEMBL
LigandPNGBDBM50582057(CHEMBL5077579)
Affinity DataEC50:  92nM. Assay description: Modulator activity at human Nav1.1 expressed in Xenopus laevis oocytes assessed as elicitation in sodium current measured after 1 to 4 days by two-el...
Ligand InfoPC cidPC sid
In DepthDetails ArticlePubMed
TargetSodium channel protein type 2 subunit alpha(Rattus norvegicus)
Uppsala University
Curated by ChEMBL
LigandPNGBDBM50582057(CHEMBL5077579)
Affinity DataEC50:  134nM. Assay description: Modulator activity at rat Nav1.2 expressed in Xenopus laevis oocytes assessed as elicitation in sodium current measured after 1 to 4 days by two-elec...
Ligand InfoPC cidPC sid
In DepthDetails ArticlePubMed
TargetSodium channel protein type 3 subunit alpha(Rattus norvegicus)
Uppsala University
Curated by ChEMBL
LigandPNGBDBM50582057(CHEMBL5077579)
Affinity DataEC50:  13nM. Assay description: Modulator activity at rat Nav1.3 expressed in Xenopus laevis oocytes assessed as elicitation in sodium current measured after 1 to 4 days by two-elec...
Ligand InfoPC cidPC sid
In DepthDetails ArticlePubMed
TargetSodium channel protein type 9 subunit alpha(Homo sapiens (Human))
Uppsala University
Curated by ChEMBL
LigandPNGBDBM50582057(CHEMBL5077579)
Affinity DataEC50:  81nM. Assay description: Modulator activity at human Nav1.7 expressed in Xenopus laevis oocytes assessed as elicitation in sodium current measured after 1 to 4 days by two-el...
Ligand InfoPC cidPC sid
In DepthDetails ArticlePubMed
TargetSodium channel protein type 5 subunit alpha(Homo sapiens (Human))
Uppsala University
Curated by ChEMBL
LigandPNGBDBM50582057(CHEMBL5077579)
Affinity DataEC50:  28nM. Assay description: Modulator activity at human Nav1.5 expressed in Xenopus laevis oocytes assessed as elicitation in sodium current measured after 1 to 4 days by two-el...
Ligand InfoPC cidPC sid
In DepthDetails ArticlePubMed
TargetSodium channel protein type 8 subunit alpha(Mus musculus)
Uppsala University
Curated by ChEMBL
LigandPNGBDBM50582057(CHEMBL5077579)
Affinity DataEC50:  124nM. Assay description: Modulator activity at mouse Nav1.6 expressed in Xenopus laevis oocytes assessed as elicitation in sodium current measured after 1 to 4 days by two-el...
Ligand InfoPC cidPC sid
In DepthDetails ArticlePubMed
TargetSodium channel protein type 4 subunit alpha(Rattus norvegicus (Rat))
Uppsala University
Curated by ChEMBL
LigandPNGBDBM50582057(CHEMBL5077579)
Affinity DataEC50:  15nM. Assay description: Modulator activity at rat Nav1.4 expressed in Xenopus laevis oocytes assessed as elicitation in sodium current measured after 1 to 4 days by two-elec...
Ligand InfoPC cidPC sid
In DepthDetails ArticlePubMed