BDBM50582221 CHEMBL5090028::US11708359, Example 60
SMILES CC(C)(C)c1cccc(c1)C12CC1CN(CC2)C(=O)[C@H]1C[C@@]2(C1)COC(=O)N2
InChI Key InChIKey=KRYBVRGWFABPLX-QGHRMTQGSA-N
Data  3 IC50
  Tab Delimited (TSV)   2D SDfile   Computed 3D by Vconf -m prep SDfile
Find this compound or compounds like it in BindingDB:
Activity Spreadsheet -- Enzyme Inhibition Constant Data from BindingDB
Found 3 hits for monomerid = 50582221
TargetMonoglyceride lipase(Homo sapiens (Human))
Therachem Research Medilab
Curated by ChEMBL
LigandPNGBDBM50582221(CHEMBL5090028 | US11708359, Example 60)
Affinity DataIC50:  0.00720nM. Assay description: Inhibition of human MGL expressed in human HeLa cells assessed as amount of cleaved glycerol measured after 1 hrs by flow through assay
Ligand InfoPC cidPC sid
In DepthDetails ArticlePubMed
TargetMonoglyceride lipase(Homo sapiens (Human))
Therachem Research Medilab
Curated by ChEMBL
LigandPNGBDBM50582221(CHEMBL5090028 | US11708359, Example 60)
Affinity DataIC50:  0.00720nM. Assay description: Inhibition of MGL activity in human HeLa cells assessed as reduction in cleaved [1,3-3H glycerol] level using [glycerol-1,3-3H]-oleoyl glycerol as su...
Ligand InfoPC cidPC sid
In DepthDetails PubMed
TargetMonoglyceride lipase(Homo sapiens (Human))
Therachem Research Medilab
Curated by ChEMBL
LigandPNGBDBM50582221(CHEMBL5090028 | US11708359, Example 60)
Affinity DataIC50:  0.00700nM. Assay description: The assay used to measure the in vitro activity of MGL is adapted from the assay used for another serine hydrolase (FAAH) described in Wilson et al.,...
Ligand InfoPC cidPC sid
In DepthDetails US Patent