BDBM50582330 CHEMBL5094886
SMILES OCC1CCCC(CNC(=O)c2cccn3c2nc2cc4ccccc4cc2c3=O)N1
InChI Key InChIKey=DOZYTOLBGKODSC-UHFFFAOYSA-N
Data  1 IC50
  Tab Delimited (TSV)   2D SDfile   Computed 3D by Vconf -m prep SDfile
Find this compound or compounds like it in BindingDB:
Activity Spreadsheet -- Enzyme Inhibition Constant Data from BindingDB
Found 1 hit for monomerid = 50582330
TargetDNA-directed RNA polymerase I subunit RPA1(Homo sapiens (Human))
Johns Hopkins University
Curated by ChEMBL
LigandPNGBDBM50582330(CHEMBL5094886)
Affinity DataIC50:  650nM. Assay description: Inhibition of RNA polymerase 1 in human A-375 assessed as RPA194 degradation measured after 4 hrs by Hoechst 33342 staining based assay
Ligand InfoPC cidPC sid
In DepthDetails ArticlePubMed