BDBM50585774 CHEMBL5086375
SMILES CN1CCC(CC1)[C@@](C)(O)c1ccc2cnc(Nc3ccc(cc3F)C#N)cc2n1
InChI Key InChIKey=XMDLNBHGNQECLZ-HSZRJFAPSA-N
Data  2 IC50
  Tab Delimited (TSV)   2D SDfile   Computed 3D by Vconf -m prep SDfile
Find this compound or compounds like it in BindingDB:
Activity Spreadsheet -- Enzyme Inhibition Constant Data from BindingDB
Found 2 hits for monomerid = 50585774
TargetCyclin-A2/Cyclin-dependent kinase 2(Homo sapiens (Human))
Goldfinc Bio
Curated by ChEMBL
LigandPNGBDBM50585774(CHEMBL5086375)
Affinity DataIC50:  33nM. Assay description: Inhibition of full length N-terminal GST tagged human CDK2(1 to 298 residues)/CyclinA2 (1 to 432 residues) expressed in baculovirus expression system...
Ligand InfoPC cidPC sid
In DepthDetails ArticlePubMed
TargetCyclin-dependent kinase 5 activator 1(Homo sapiens (Human))
Goldfinc Bio
Curated by ChEMBL
LigandPNGBDBM50585774(CHEMBL5086375)
Affinity DataIC50:  0.800nM. Assay description: Inhibition of full length N-terminal GST fused human CDK5(1 to 292 residues)/ p25 (99 to 307 residues) expressed in baculovirus expression system usi...
Ligand InfoPC cidPC sid
In DepthDetails ArticlePubMed