BDBM50586354 CHEMBL5078323
SMILES OP(O)(=O)Oc1cc(OP(O)(O)=O)c(cc1OP(O)(O)=O)-c1cc(OP(O)(O)=O)c(OP(O)(O)=O)cc1OP(O)(O)=O
InChI Key InChIKey=REBFLNOBYPJKFK-UHFFFAOYSA-N
Data  3 IC50
  Tab Delimited (TSV)   2D SDfile   Computed 3D by Vconf -m prep SDfile
Find this compound or compounds like it in BindingDB:
Activity Spreadsheet -- Enzyme Inhibition Constant Data from BindingDB
Found 3 hits for monomerid = 50586354
TargetPhosphatidylinositol 3,4,5-trisphosphate 5-phosphatase 2(Homo sapiens (Human))
University Of East Anglia
Curated by ChEMBL
LigandPNGBDBM50586354(CHEMBL5078323)
Affinity DataIC50:  27nM. Assay description: Inhibition of 2-FAM-InsP5 binding to human SHIP2 catalytic domain (419 to 832 residues) assessed as change in polarization by fluorescence polarizati...
Ligand InfoPC cidPC sid
In DepthDetails ArticlePubMed
TargetPhosphatidylinositol 3,4,5-trisphosphate 5-phosphatase 2(Homo sapiens (Human))
University Of East Anglia
Curated by ChEMBL
LigandPNGBDBM50586354(CHEMBL5078323)
Affinity DataIC50:  900nM. Assay description: Inhibition of human SHIP2 catalytic domain (419 to 832 residues) phosphatase activity assessed as inhibition of Ins(1,3,4,5)P4 production using Ins(1...
Ligand InfoPC cidPC sid
In DepthDetails ArticlePubMed
TargetPhosphatidylinositol 3,4,5-trisphosphate 5-phosphatase 2(Homo sapiens (Human))
University Of East Anglia
Curated by ChEMBL
LigandPNGBDBM50586354(CHEMBL5078323)
Affinity DataIC50:  1.60E+3nM. Assay description: Inhibition of human SHIP2 catalytic domain (419 to 832 residues) phosphatase activity assessed as phosphate release using Ins(1,3,4,5)P4 as substrate...
Ligand InfoPC cidPC sid
In DepthDetails ArticlePubMed