BDBM50589098 CHEMBL5171487
SMILES Cn1c(nc2cc(ccc12)B(O)O)-c1ccccc1
InChI Key InChIKey=GNWLWMNJEJNOHA-UHFFFAOYSA-N
Data  4 IC50
  Tab Delimited (TSV)   2D SDfile   Computed 3D by Vconf -m prep SDfile
Find this compound or compounds like it in BindingDB:
Activity Spreadsheet -- Enzyme Inhibition Constant Data from BindingDB
Found 4 hits for monomerid = 50589098
TargetCarbonic anhydrase 1(Homo sapiens (Human))
Isf College Of Pharmacy
Curated by ChEMBL
LigandPNGBDBM50589098(CHEMBL5171487)
Affinity DataIC50: >360nM. Assay description: Inhibition of human recombinant CA1 incubated for 15 mins prior to testing by phenol red based stopped-flow CO2 hydration assay
Ligand InfoPC cidPC sid
In DepthDetails PubMed
TargetCarbonic anhydrase 12(Homo sapiens (Human))
Isf College Of Pharmacy
Curated by ChEMBL
LigandPNGBDBM50589098(CHEMBL5171487)
Affinity DataIC50: >360nM. Assay description: Inhibition of human recombinant CA12 incubated for 15 mins prior to testing by phenol red based stopped-flow CO2 hydration assay
Ligand InfoPC cidPC sid
In DepthDetails PubMed
TargetCarbonic anhydrase 9(Homo sapiens (Human))
Isf College Of Pharmacy
Curated by ChEMBL
LigandPNGBDBM50589098(CHEMBL5171487)
Affinity DataIC50: >360nM. Assay description: Inhibition of human recombinant CA9 incubated for 15 mins prior to testing by phenol red based stopped-flow CO2 hydration assay
Ligand InfoPC cidPC sid
In DepthDetails PubMed
TargetCarbonic anhydrase 2(Homo sapiens (Human))
Isf College Of Pharmacy
Curated by ChEMBL
LigandPNGBDBM50589098(CHEMBL5171487)
Affinity DataIC50: >360nM. Assay description: Inhibition of human recombinant CA2 incubated for 15 mins prior to testing by phenol red based stopped-flow CO2 hydration assay
Ligand InfoPC cidPC sid
In DepthDetails PubMed