BDBM50589148 CHEMBL5187847
SMILES COc1ccc(cc1)-c1nc(N2N=C(CCC2=O)c2ccc(F)cc2)n(C)c(=O)c1C#N
InChI Key InChIKey=BXSBHQJCBIHRNR-UHFFFAOYSA-N
Data  2 IC50
  Tab Delimited (TSV)   2D SDfile   Computed 3D by Vconf -m prep SDfile
Find this compound or compounds like it in BindingDB:
Activity Spreadsheet -- Enzyme Inhibition Constant Data from BindingDB
Found 2 hits for monomerid = 50589148
TargetCytochrome c oxidase subunit 1(Homo sapiens (Human))
Key Laboratory Of Technology Of Drug Preparation (Zhengzhou University)
Curated by ChEMBL
LigandPNGBDBM50589148(CHEMBL5187847)
Affinity DataIC50:  1.15E+5nM. Assay description: Inhibition of COX-1 (unknown origin)
Ligand InfoPC cidPC sid
In DepthDetails PubMed
TargetCytochrome c oxidase subunit 2(Homo sapiens (Human))
Key Laboratory Of Technology Of Drug Preparation (Zhengzhou University)
Curated by ChEMBL
LigandPNGBDBM50589148(CHEMBL5187847)
Affinity DataIC50:  1.40E+3nM. Assay description: Inhibition of COX-2 (unknown origin)
Ligand InfoPC cidPC sid
In DepthDetails PubMed