BDBM50589650 CHEMBL5202961
SMILES COc1cc(OCC(=O)Nc2cc(OC(F)(F)F)ccc2-n2cncn2)ccc1OC1COC1
InChI Key InChIKey=KGZJVSVIUHWKQW-UHFFFAOYSA-N
Data  4 IC50
  Tab Delimited (TSV)   2D SDfile   Computed 3D by Vconf -m prep SDfile
Find this compound or compounds like it in BindingDB:
Activity Spreadsheet -- Enzyme Inhibition Constant Data from BindingDB
Found 4 hits for monomerid = 50589650
TargetMetabotropic glutamate receptor 7(Rattus norvegicus (Rat))
Vanderbilt University
Curated by ChEMBL
LigandPNGBDBM50589650(CHEMBL5202961)
Affinity DataIC50:  263nM. Assay description: Negative allosteric modulation of rat mGlu7 in HEK cells expressing Galpha15 assessed as inhibition of L-AP4-induced response measured by calcium mob...
Ligand InfoPC cidPC sid
In DepthDetails PubMed
TargetMetabotropic glutamate receptor 7(Homo sapiens (Human))
Vanderbilt University
Curated by ChEMBL
LigandPNGBDBM50589650(CHEMBL5202961)
Affinity DataIC50:  813nM. Assay description: Negative allosteric modulation of mGlu7 (unknown origin) in cells expressing G protein-regulated inwardly rectifying potassium channels (GIRKs) asses...
Ligand InfoPC cidPC sid
In DepthDetails PubMed
TargetMetabotropic glutamate receptor 7(Homo sapiens (Human))
Vanderbilt University
Curated by ChEMBL
LigandPNGBDBM50589650(CHEMBL5202961)
Affinity DataIC50:  819nM. Assay description: Negative allosteric modulation of mGlu7 (unknown origin) in cells expressing G protein-regulated inwardly rectifying potassium channels (GIRKs) asses...
Ligand InfoPC cidPC sid
In DepthDetails PubMed
TargetMetabotropic glutamate receptor 7(Rattus norvegicus (Rat))
Vanderbilt University
Curated by ChEMBL
LigandPNGBDBM50589650(CHEMBL5202961)
Affinity DataIC50:  263nM. Assay description: Negative allosteric modulation of rat mGlu7 in HEK cells expressing Galpha15 assessed as inhibition of L-AP4-induced response measured by calcium mob...
Ligand InfoPC cidPC sid
In DepthDetails PubMed