BDBM50590037 CHEMBL5191309
SMILES [H][C@]12CSc3nnc(SC[C@]([H])(NC(=O)[C@H](CCCNC(N)=N)NC(=O)[C@H](CC(O)=O)NC(=O)[C@H](Cc4c[nH]c5ccccc45)NC(=O)[C@H](CCCNC(N)=N)NC(=O)[C@H](Cc4ccccc4)NC(=O)[C@H](Cc4cnc[nH]4)NC(=O)CNC(=O)[C@H](CCCC)NC1=O)C(=O)N[C@@H](Cc1cnc[nH]1)C(=O)N[C@@H](Cc1ccccc1)C(=O)N[C@@H](CCCNC(N)=N)C(=O)N[C@@H](Cc1c[nH]c4ccccc14)C(=O)N[C@@H](CCCNC(N)=N)C(=O)N2)nn3
InChI Key InChIKey=ZKFHMXVIVJCDFY-KHKKPXNASA-N
Data  3 KI  1 IC50  4 EC50
  Tab Delimited (TSV)   2D SDfile   Computed 3D by Vconf -m prep SDfile
Find this compound or compounds like it in BindingDB:
Activity Spreadsheet -- Enzyme Inhibition Constant Data from BindingDB
Found 8 hits for monomerid = 50590037
TargetMelanocyte-stimulating hormone receptor(Homo sapiens (Human))
The University Of Queensland
Curated by ChEMBL
LigandPNGBDBM50590037(CHEMBL5191309)
Affinity DataKi:  0.724nM. Assay description: Displacement of [125I]-NDP-alpha-MSH from human MC1R expressed in HEK2936E cell membrane measured after 16 to 23 hrs by 1450 microbeta trilux scintil...
Ligand InfoPC cidPC sid
In DepthDetails PubMed
TargetMelanocortin receptor 3(Homo sapiens (Human))
The University Of Queensland
Curated by ChEMBL
LigandPNGBDBM50590037(CHEMBL5191309)
Affinity DataKi:  11nM. Assay description: Displacement of [125I]-NDP-alpha-MSH from human MC3R expressed in HEK2936E cell membrane measured after 16 to 23 hrs by 1450 microbeta trilux scintil...
Ligand InfoPC cidPC sid
In DepthDetails PubMed
TargetMelanocortin receptor 4(Homo sapiens (Human))
The University Of Queensland
Curated by ChEMBL
LigandPNGBDBM50590037(CHEMBL5191309)
Affinity DataKi:  34nM. Assay description: Displacement of [125I]-NDP-alpha-MSH from human MC4R expressed in HEK2936E cell membrane measured after 16 to 23 hrs by 1450 microbeta trilux scintil...
Ligand InfoPC cidPC sid
In DepthDetails PubMed
TargetMelanocortin receptor 4(Homo sapiens (Human))
The University Of Queensland
Curated by ChEMBL
LigandPNGBDBM50590037(CHEMBL5191309)
Affinity DataEC50:  1.80nM. Assay description: Antagonist activity at human MC4R expressed in HEK2936E cells assessed as cAMP production in presence of IBMX by time resolved fluorescence assay
Ligand InfoPC cidPC sid
In DepthDetails PubMed
TargetMelanocortin receptor 3(Homo sapiens (Human))
The University Of Queensland
Curated by ChEMBL
LigandPNGBDBM50590037(CHEMBL5191309)
Affinity DataEC50:  0.182nM. Assay description: Agonist activity at human MC3R expressed in HEK2936E cells assessed as cAMP production in presence of IBMX by time resolved fluorescence assay
Ligand InfoPC cidPC sid
In DepthDetails PubMed
TargetMelanocyte-stimulating hormone receptor(Homo sapiens (Human))
The University Of Queensland
Curated by ChEMBL
LigandPNGBDBM50590037(CHEMBL5191309)
Affinity DataEC50:  0.00400nM. Assay description: Agonist activity at human MC1R expressed in HEK2936E cells assessed as cAMP production in presence of IBMX by time resolved fluorescence assay
Ligand InfoPC cidPC sid
In DepthDetails PubMed
TargetMelanocortin receptor 5(Homo sapiens (Human))
The University Of Queensland
Curated by ChEMBL
LigandPNGBDBM50590037(CHEMBL5191309)
Affinity DataIC50:  42nM. Assay description: Agonist activity at human MC5R expressed in HEK2936E cells assessed as cAMP production in presence of IBMX by time resolved fluorescence assay
Ligand InfoPC cidPC sid
In DepthDetails PubMed
TargetMelanocyte-stimulating hormone receptor(Homo sapiens (Human))
The University Of Queensland
Curated by ChEMBL
LigandPNGBDBM50590037(CHEMBL5191309)
Affinity DataEC50:  0.0447nM. Assay description: Agonist activity at human MC1R expressed in HEK2936E cells assessed as cAMP production in presence of IBMX by time resolved fluorescence assay
Ligand InfoPC cidPC sid
In DepthDetails PubMed