BDBM50590484 CHEMBL5190968
SMILES CC(C)S(=O)(=O)c1ccccc1Nc1nc(Nc2ccc(CN3CCC(CC3)C(=O)NCCO)cc2)ncc1Cl
InChI Key InChIKey=RNLHHEYNJZSKEV-UHFFFAOYSA-N
Data  1 IC50
  Tab Delimited (TSV)   2D SDfile   Computed 3D by Vconf -m prep SDfile
Find this compound or compounds like it in BindingDB:
Activity Spreadsheet -- Enzyme Inhibition Constant Data from BindingDB
Found 1 hit for monomerid = 50590484
TargetFocal adhesion kinase 1(Homo sapiens (Human))
Dalian Medical University
Curated by ChEMBL
LigandPNGBDBM50590484(CHEMBL5190968)
Affinity DataIC50:  0.192nM. Assay description: Inhibition of recombinant human FAK (393 to 698 residues) using poly (4:1 Glu, Tyr) peptide as substrate incubated for 60 mins in presence of ATP by ...
Ligand InfoPC cidPC sid
In DepthDetails PubMed