BDBM50591077 CHEMBL5201930
SMILES CNC(=O)[C@]1(C)CC[C@H](C1)Nc1ncc2c(Br)nn(-c3ccc(-c4nnc(C)s4)c(CCN)c3)c2n1
InChI Key InChIKey=SYLFBBHVQXOAKZ-OYLFLEFRSA-N
Data  2 IC50
  Tab Delimited (TSV)   2D SDfile   Computed 3D by Vconf -m prep SDfile
Find this compound or compounds like it in BindingDB:
Activity Spreadsheet -- Enzyme Inhibition Constant Data from BindingDB
Found 2 hits for monomerid = 50591077
TargeteIF-2-alpha kinase GCN2(Homo sapiens (Human))
Rapt Therapeutics
Curated by ChEMBL
LigandPNGBDBM50591077(CHEMBL5201930)
Affinity DataIC50:  240nM. Assay description: Inhibition of GCN2 in human SK-OV-3 cells assessed as reduction in phosphorylation of eIF2alpha by cellular assay
Ligand InfoPC cidPC sid
In DepthDetails PubMed
TargeteIF-2-alpha kinase GCN2(Homo sapiens (Human))
Rapt Therapeutics
Curated by ChEMBL
LigandPNGBDBM50591077(CHEMBL5201930)
Affinity DataIC50:  15nM. Assay description: Inhibition of GCN2 (unknown origin)
Ligand InfoPC cidPC sid
In DepthDetails PubMed