BDBM50591664 CHEMBL5182721
SMILES CC(CNC(=O)c1c(C)c(C)cc2c(O)c(c(C)cc12)-c1ccc2c(C(=O)NCC(C)c3ccccc3)c(O)c(O)cc2c1O)c1ccccc1
InChI Key InChIKey=PAQMNQMJIIMSDG-UHFFFAOYSA-N
Data  1 IC50
  Tab Delimited (TSV)   2D SDfile   Computed 3D by Vconf -m prep SDfile
Find this compound or compounds like it in BindingDB:
Activity Spreadsheet -- Enzyme Inhibition Constant Data from BindingDB
Found 1 hit for monomerid = 50591664
TargetBcl-2 homologous antagonist/killer(Homo sapiens)
National University Of Ireland Galway
Curated by ChEMBL
LigandPNGBDBM50591664(CHEMBL5182721)
Affinity DataIC50:  620nM. Assay description: Inhibition of Mcl-1/Bak (unknown origin)
Ligand InfoPC cidPC sid
In DepthDetails PubMed