BDBM50592222 CHEMBL5180135
SMILES CC(C)(C)NC(=O)NC1CCN(CC1)C(=O)[C@H](Cc1cccc(c1)C(N)=N)NS(=O)(=O)c1cccc(c1)-c1cccc(CN)c1
InChI Key InChIKey=JASIWQPRQIUEHP-LJAQVGFWSA-N
Data  3 KI
  Tab Delimited (TSV)   2D SDfile   Computed 3D by Vconf -m prep SDfile
Find this compound or compounds like it in BindingDB:
Activity Spreadsheet -- Enzyme Inhibition Constant Data from BindingDB
Found 3 hits for monomerid = 50592222
TargetCoagulation factor X(Homo sapiens (Human))
Philipps University
Curated by ChEMBL
LigandPNGBDBM50592222(CHEMBL5180135)
Affinity DataKi:  0.100nM. Assay description: Binding affinity to FXa (unknown origin) using Mes-DArg-Pro-Arg-AMC as substrate
Ligand InfoPC cidPC sid
In DepthDetails PubMed
TargetSuppressor of tumorigenicity 14 protein(Homo sapiens (Human))
Philipps University
Curated by ChEMBL
LigandPNGBDBM50592222(CHEMBL5180135)
Affinity DataKi:  1nM. Assay description: Binding affinity to N-terminal MRGS(His)6GSDDDDK-tagged Matriptase (unknown origin) expressed in Escherichia coli assessed as inhibition constant usi...
Ligand InfoPC cidPC sid
In DepthDetails PubMed
TargetProthrombin(Bos taurus (Bovine))
Philipps University
Curated by ChEMBL
LigandPNGBDBM50592222(CHEMBL5180135)
Affinity DataKi:  1.32E+3nM. Assay description: Binding affinity to bovine thrombin assessed as inhibition constant using tosyl-Gly-Pro-Arg-AMC as substrate
Ligand InfoPC cidPC sid
In DepthDetails PubMed