BDBM50594008 CHEMBL5181107
SMILES O=c1[nH][nH]c(=O)c2cc(OCC3CC3)ccc12
InChI Key InChIKey=IURJTWHWLCVJAK-UHFFFAOYSA-N
Data  7 IC50
  Tab Delimited (TSV)   2D SDfile   Computed 3D by Vconf -m prep SDfile
Find this compound or compounds like it in BindingDB:
Activity Spreadsheet -- Enzyme Inhibition Constant Data from BindingDB
Found 7 hits for monomerid = 50594008
TargetProtein mono-ADP-ribosyltransferase PARP10(Homo sapiens (Human))
University Of Perugia
Curated by ChEMBL
LigandPNGBDBM50594008(CHEMBL5181107)
Affinity DataIC50:  310nM. Assay description: Inhibition of human PARP-10 using NAD+ as substrate incubated for 10 mins by fluorescence based analysis
Ligand InfoPC cidPC sid
In DepthDetails PubMed
TargetProtein mono-ADP-ribosyltransferase PARP10(Homo sapiens (Human))
University Of Perugia
Curated by ChEMBL
LigandPNGBDBM50594008(CHEMBL5181107)
Affinity DataIC50:  309nM. Assay description: Inhibition of human PARP-10 using NAD+ as substrate incubated for 10 mins by fluorescence based analysis
Ligand InfoPC cidPC sid
In DepthDetails PubMed
TargetProtein mono-ADP-ribosyltransferase PARP15(Homo sapiens (Human))
University Of Perugia
Curated by ChEMBL
LigandPNGBDBM50594008(CHEMBL5181107)
Affinity DataIC50:  1.20E+3nM. Assay description: Inhibition of human N-terminal 6His-tagged PARP15 (460 to 656 residues) expressed in Escherichia coli Rosetta2 (DE3) cells using NAD+ as substrate in...
Ligand InfoPC cidPC sid
In DepthDetails PubMed
TargetPoly [ADP-ribose] polymerase tankyrase-2(Homo sapiens (Human))
University Of Perugia
Curated by ChEMBL
LigandPNGBDBM50594008(CHEMBL5181107)
Affinity DataIC50: >1.00E+5nM. Assay description: Inhibition of human N-terminal 6His-tagged TNKS2 (1030 to 1317 residues) expressed in Escherichia coli Rosetta2 (DE3) cells using NAD+ as substrate i...
Ligand InfoPC cidPC sid
In DepthDetails PubMed
TargetProtein mono-ADP-ribosyltransferase PARP14(Homo sapiens (Human))
University Of Perugia
Curated by ChEMBL
LigandPNGBDBM50594008(CHEMBL5181107)
Affinity DataIC50: >1.00E+4nM. Assay description: Inhibition of human PARP14 using NAD+ as substrate incubated for 10 mins by fluorescence based analysis
Ligand InfoPC cidPC sid
In DepthDetails PubMed
TargetPoly [ADP-ribose] polymerase 2(Homo sapiens (Human))
University Of Perugia
Curated by ChEMBL
LigandPNGBDBM50594008(CHEMBL5181107)
Affinity DataIC50: >1.00E+5nM. Assay description: Inhibition of human PARP2 using NAD+ as substrate incubated for 10 mins by fluorescence based analysis
Ligand InfoPC cidPC sid
In DepthDetails PubMed
TargetProtein mono-ADP-ribosyltransferase PARP15(Homo sapiens (Human))
University Of Perugia
Curated by ChEMBL
LigandPNGBDBM50594008(CHEMBL5181107)
Affinity DataIC50:  1.20E+3nM. Assay description: Inhibition of human N-terminal 6His-tagged PARP15 (460 to 656 residues) expressed in Escherichia coli Rosetta2 (DE3) cells using NAD+ as substrate in...
Ligand InfoPC cidPC sid
In DepthDetails PubMed