BDBM50594080 CHEMBL5208341
SMILES COc1cc2nc(NCCCN(C)C)nc(NC3CCNCC3)c2cc1OC
InChI Key InChIKey=IWCQFLMFZIICRT-UHFFFAOYSA-N
Data  1 KI  1 Kd
  Tab Delimited (TSV)   2D SDfile   Computed 3D by Vconf -m prep SDfile
Find this compound or compounds like it in BindingDB:
Activity Spreadsheet -- Enzyme Inhibition Constant Data from BindingDB
Found 2 hits for monomerid = 50594080
TargetHistone-lysine N-methyltransferase EHMT2(Homo sapiens (Human))
Sapienza University Of Rome
Curated by ChEMBL
LigandPNGBDBM50594080(CHEMBL5208341)
Affinity DataKi:  4.83E+3nM. Assay description: Inhibition of G9a (unknown origin) assessed as reduction in substrate methylation using histone H3 and SAM as substrate measured after 15 to 60 mins ...
Ligand InfoPC cidPC sid
In DepthDetails PubMed
TargetREST corepressor 1(Homo sapiens (Human))
Sapienza University Of Rome
Curated by ChEMBL
LigandPNGBDBM50594080(CHEMBL5208341)
Affinity DataKd:  1.56E+3nM. Assay description: Binding affinity to human LSD1/CoREST assessed as dissociation constant by competitive fluorescence polarization assay
Ligand InfoPC cidPC sid
In DepthDetails PubMed