BDBM50594240 CHEMBL5202156
SMILES C[C@H]1CN(C[C@@H](C)O1)[C@@H]1CNc2cc(\C=C\C(=O)N(C)Cc3oc4ccccc4c3C)cnc2NC1=O
InChI Key InChIKey=DAGOPMBJSMEUQB-FAZXCSNRSA-N
Data  1 IC50
  Tab Delimited (TSV)   2D SDfile   Computed 3D by Vconf -m prep SDfile
Find this compound or compounds like it in BindingDB:
Activity Spreadsheet -- Enzyme Inhibition Constant Data from BindingDB
Found 1 hit for monomerid = 50594240
TargetEnoyl-[acyl-carrier-protein] reductase [NADH] FabI(Escherichia coli)
Ri.Med Foundation
Curated by ChEMBL
LigandPNGBDBM50594240(CHEMBL5202156)
Affinity DataIC50: <10nM. Assay description: Inhibition of Escherichia coli FabL assessed as measuring NADH consumption rate
Ligand InfoPC cidPC sid
In DepthDetails PubMed