BDBM50594262 CHEMBL5187652
SMILES CNC(=O)[C@H](CNC(=O)c1ccc2c(c1)c(=O)[nH][nH]c2=O)NC(=O)c1cccc(C)c1
InChI Key InChIKey=MESGLGFHEOHMMW-INIZCTEOSA-N
Data  1 IC50
  Tab Delimited (TSV)   2D SDfile   Computed 3D by Vconf -m prep SDfile
Find this compound or compounds like it in BindingDB:
Activity Spreadsheet -- Enzyme Inhibition Constant Data from BindingDB
Found 1 hit for monomerid = 50594262
TargetProtein mono-ADP-ribosyltransferase PARP15(Homo sapiens (Human))
University Of Perugia
Curated by ChEMBL
LigandPNGBDBM50594262(CHEMBL5187652)
Affinity DataIC50:  510nM. Assay description: Inhibition of biotinylated recombinant human PARP15 expressed in Escherichia coli BL21 (DE3)
Ligand InfoPC cidPC sid
In DepthDetails PubMed