BDBM50595596 CHEMBL5203670
SMILES CCCc1cc(=O)[nH]c(SCC(=O)c2ccc3NC(=O)CCCc3c2)n1
InChI Key InChIKey=WVRKQDZPZOUPNW-UHFFFAOYSA-N
Data  4 IC50
  Tab Delimited (TSV)   2D SDfile   Computed 3D by Vconf -m prep SDfile
Find this compound or compounds like it in BindingDB:
Activity Spreadsheet -- Enzyme Inhibition Constant Data from BindingDB
Found 4 hits for monomerid = 50595596
TargetAldo-keto reductase family 1 member C1(Homo sapiens (Human))
China Pharmaceutical University
Curated by ChEMBL
LigandPNGBDBM50595596(CHEMBL5203670)
Affinity DataIC50:  470nM. Assay description: Inhibition of human recombinant AKR1C1 transfected in Escherichia coli BL21 (DE3) pLysS competent cells assessed as inhibition of NADP+ dependent oxi...
In DepthDetails PubMed
TargetAldo-keto reductase family 1 member C4(Homo sapiens (Human))
China Pharmaceutical University
Curated by ChEMBL
LigandPNGBDBM50595596(CHEMBL5203670)
Affinity DataIC50:  360nM. Assay description: Inhibition of human recombinant AKR1C4 transfected in Escherichia coli BL21 (DE3) pLysS competent cells assessed as inhibition of NADP+ dependent oxi...
In DepthDetails PubMed
TargetAldo-keto reductase family 1 member C3(Homo sapiens (Human))
China Pharmaceutical University
Curated by ChEMBL
LigandPNGBDBM50595596(CHEMBL5203670)
Affinity DataIC50:  190nM. Assay description: Inhibition of human recombinant AKR1C3 transfected in Escherichia coli BL21 (DE3) pLysS competent cells assessed as inhibition of NADP+ dependent oxi...
In DepthDetails PubMed
TargetAldo-keto reductase family 1 member C2(Homo sapiens (Human))
China Pharmaceutical University
Curated by ChEMBL
LigandPNGBDBM50595596(CHEMBL5203670)
Affinity DataIC50:  730nM. Assay description: Inhibition of human recombinant AKR1C2 transfected in Escherichia coli BL21 (DE3) pLysS competent cells assessed as inhibition of NADP+ dependent oxi...
In DepthDetails PubMed