BDBM50595850 CHEMBL5188021
SMILES CCCC[C@@H](NC(=O)[C@@H](Cc1ccccc1)NC(=O)[C@H](N)Cc1ccc(O)cc1)C(=O)N[C@H](CCCNC(N)=N)C(N)=O
InChI Key InChIKey=RRECJRUTBHIJFH-ZGFBMJKBSA-N
Data  1 KI  1 EC50
  Tab Delimited (TSV)   2D SDfile   Computed 3D by Vconf -m prep SDfile
Find this compound or compounds like it in BindingDB:
Activity Spreadsheet -- Enzyme Inhibition Constant Data from BindingDB
Found 2 hits for monomerid = 50595850
TargetKappa-type opioid receptor(Cavia porcellus (domestic guinea pig))
Universit£
Curated by ChEMBL
LigandPNGBDBM50595850(CHEMBL5188021)
Affinity DataKi:  1.10nM. Assay description: Displacement of [3H]-HS665 from KOR in guinea pig brain membranes
Ligand InfoPC cidPC sid
In DepthDetails PubMed
TargetKappa-type opioid receptor(Cavia porcellus (domestic guinea pig))
Universit£
Curated by ChEMBL
LigandPNGBDBM50595850(CHEMBL5188021)
Affinity DataEC50:  9.55E+3nM. Assay description: Agonist activity at KOR in guinea pig brain membranes assessed as stimulation of [35S]GTPgammaS binding measured after 1 hr by liquid scintillation c...
Ligand InfoPC cidPC sid
In DepthDetails PubMed