BDBM50595859 CHEMBL5192731
SMILES [H][C@@]12NC(=N)N[C@]11N(C[C@H](NC(=O)c3ccccc3C(F)(F)F)C1(O)O)C(=N)N[C@H]2CO
InChI Key InChIKey=PIGHRURPFWHXDQ-VEABSNGSSA-N
Data  2 IC50
  Tab Delimited (TSV)   2D SDfile   Computed 3D by Vconf -m prep SDfile
Find this compound or compounds like it in BindingDB:
Activity Spreadsheet -- Enzyme Inhibition Constant Data from BindingDB
Found 2 hits for monomerid = 50595859
TargetSodium channel protein type 4 subunit alpha(Homo sapiens (Human))
Siteone Therapeutics
Curated by ChEMBL
LigandPNGBDBM50595859(CHEMBL5192731)
Affinity DataIC50:  2nM. Assay description: Inhibition of human Nav1.4 expressed in HEK293 cells by whole cell patch clamp electrophysiology recording
Ligand InfoPC cidPC sid
In DepthDetails PubMed
TargetSodium channel protein type 9 subunit alpha(Homo sapiens (Human))
Siteone Therapeutics
Curated by ChEMBL
LigandPNGBDBM50595859(CHEMBL5192731)
Affinity DataIC50:  3nM. Assay description: Inhibition of human Nav1.7 expressed in HEK293 cells by whole cell patch clamp electrophysiology recording
Ligand InfoPC cidPC sid
In DepthDetails PubMed